40902-41501

40651-40931 threads.html 41092-41478
[ruby-dev:40902] [Feature #2969] String#to_f  が -h.hhh±pd を解釈できるように
[ruby-dev:40903] [Bug #1234](Closed) RDoc failure in benchmark/bm_so_meteor_contest.rb at or around line 542 column
[ruby-dev:40906] Benchmark::Tms#add!がNameErrorになる
[ruby-dev:40908] [Bug:trunk] test_float_hex failure
[ruby-dev:40909] test_float_hex failure [test/ruby/test_sprintf.rb:202]
[ruby-dev:40910] overflow of time on FreeBSD
[ruby-dev:40911] iseq_s_load が filepath  の指定のない ISeq  で TypeError  発生
[ruby-dev:40912] [Bug #1582](Closed) IO.new Raises Other Errors between 1.8 and 1.9
[ruby-dev:40913] [Bug #3064](Rejected)  TypedDataについてのドキュメントがない
[ruby-dev:40914] 1.9.2 spec has been frozen
[ruby-dev:40917] テスト対象を 2 つ指定すると落ちる
[ruby-dev:40922] [Bug #2724] fork from other than the main thread causes wrong pthread condition on NetBSD
[ruby-dev:40923] [Bug #2724] fork from other than the main thread causes wrong pthread condition on NetBSD
[ruby-dev:40924] [Feature #3018](Closed) UNINITIALIZED_VAR()  マクロの導入
[ruby-dev:40926] [Bug #3107] AIXで--with-opt-dir
[ruby-dev:40927] [Bug #3108] locationが初期化前に参照されて落ちます。
[ruby-dev:40928] [Feature #2674] RubyVM::InstructionSequence to accept IOs
[ruby-dev:40929] [Feature #3069](Rejected) [TypedData]  関連APIの名前が不揃い
[ruby-dev:40930] [Feature #2674] RubyVM::InstructionSequence to accept IOs
[ruby-dev:40932] [Feature #2442](Closed) [irb] interactive help
[ruby-dev:40933] [Bug #1191] Net::IMAP.encode_utf7 bug?
[ruby-dev:40934] [Bug #1270](Closed) FileUtils.chown:  グループを数値指定するとTypeError
[ruby-dev:40935] [Bug #1969] irb will be stuck with long variable name with completion.rb
[ruby-dev:40936] [Bug #1952](Open) cannot stop with Ctrl+C
[ruby-dev:40937] [Bug #2965](Closed) method `===' called on hidden T_STRING object (NotImplementedError)
[ruby-dev:40938] URI.decode_www_form("?a=b")
[ruby-dev:40941] [Bug #2821](Closed) Dir.[] returns unmatched path
[ruby-dev:40946] [Bug #1615](Feedback)  添付ライブラリを使って巨大なCSVファイルを書き出すときにインタープリタがSegmentation Faultを起こす
[ruby-dev:40947] [Bug #3108](Closed) locationが初期化前に参照されて落ちます。
[ruby-dev:40948] [Bug #595] Fiber ignores ensure clause
[ruby-dev:40949] lib/uri/common.rb:720:16: Unrecognized directive 'nodoc'
[ruby-dev:40951] [Bug #3123] uninitialized constant Object::C (NameError)
[ruby-dev:40953] [Bug #3126] irb/completionでTypeError
[ruby-dev:40954] [Bug #3127] Encoding#replicate(non_string)
[ruby-dev:40955] [Bug #3127](Closed) Encoding#replicate(non_string)
[ruby-dev:40956] [Bug #3107](Closed) AIXで--with-opt-dir
[ruby-dev:40957] [Bug #2727](Third Party's Issue) make: *** [encdb.h] Aborted
[ruby-dev:40958] [Bug #2652](Closed) three bugs of Matrix::Scalar
[ruby-dev:40959] [Bug #3136] reuse of singleton method definition causes SEGV
[ruby-dev:40960] [Bug #2651](Closed) Matrix#compare_by_row_vectors does not receive array of  Vector
[ruby-dev:40961] [Bug #3137] complex.rb changes exceptions of Math
[ruby-dev:40962] [Bug #3137] complex.rb changes exceptions of Math
[ruby-dev:40963] [Bug #3137] complex.rb changes exceptions of Math
[ruby-dev:40964] [Feature #3036](Closed) String#encode(to, from, opt)  の opt[:replace]  に Hash
[ruby-dev:40966] [Bug #3126](Closed) irb/completionでTypeError
[ruby-dev:40973] [BUG: trunk]arm-linux向けクロスコンパイル時のエラー
[ruby-dev:40975] [Bug #3141] yield in an eigenclass definition
[ruby-dev:40977] [Bug #812] Failure: test_priority (TestThread) on mswin32
[ruby-dev:40978] [Bug #924] encoding for stdio's
[ruby-dev:40979] [Bug #1031] -U  オプションの説明が --help  にない
[ruby-dev:40982] [Bug #1191] Net::IMAP.encode_utf7 bug?
[ruby-dev:40985] [Bug #924](Closed) encoding for stdio's
[ruby-dev:40986] [Bug #3145](Closed) arm-linux向けクロスコンパイル時のエラー
[ruby-dev:40987] [Bug #1676](Closed) only last "return" is traced by set_trace_func
[ruby-dev:40989] [Bug #3146] ERB single line comment does not work
[ruby-dev:40992] Mac OS X の ruby 1.9.1p378 で再 open  後 delete した Tempfile が closed stream  になる
[ruby-dev:40993] [Backport #3149] Mac OS X  の ruby 1.9.1p378 で再 open  後 delete  した Tempfile が closed stream  になる
[ruby-dev:40996] [RubySpec #3154] Hidden allocate, new and superclass methods on 1.9.2
[ruby-dev:40997] [RubySpec #3154] Hidden allocate, new and superclass methods on 1.9.2
[ruby-dev:40999] [Bug #2074] json  の j  や jj  は module_function  にするべき?
[ruby-dev:41000] [Bug #1191](Closed) Net::IMAP.encode_utf7 bug?
[ruby-dev:41001] [Bug #1969](Closed) irb will be stuck with long variable name with completion.rb
[ruby-dev:41003] [Bug #2374](Rejected) URI.regexp('http')  が 'http://'  にマッチする
[ruby-dev:41004] [Bug #1788] ある種のメソッドをalias_methodしようとすると落ちる
[ruby-dev:41005] [Bug #2226](Closed) case   文の式が省略され when  節に配列展開があるときの挙動
[ruby-dev:41006] [Bug #1788] ある種のメソッドをalias_methodしようとすると落ちる
[ruby-dev:41007] [Bug #3136] reuse of singleton method definition causes SEGV
[ruby-dev:41008] [Bug #2402] super in instance_eval
[ruby-dev:41009] [Bug #3136] reuse of singleton method definition causes SEGV
[ruby-dev:41010] [Bug #3168] TypeError in Timeout.timeout
[ruby-dev:41011] [Bug #3170] timeout() does'nt work with Non Integer/Float Argument
[ruby-dev:41012] [Bug #3168](Closed) TypeError in Timeout.timeout
[ruby-dev:41013] [Bug #2976] cucumberでSEGV
[ruby-dev:41014] [Bug #2976](Closed) cucumberでSEGV
[ruby-dev:41015] [Bug #3170] timeout() does'nt work with Non Integer/Float Argument
[ruby-dev:41016] [Bug #2688](Closed) rubyspec: Net::HTTPHeader#content_range returns a Range  object that represents the 'Content-Range' header entry FAILED
[ruby-dev:41017] [Bug #2704] CGI::rfc1123_date causes NameError
[ruby-dev:41018] [Bug #3177] TestFileUtils#test_cp_r_symlink
[ruby-dev:41019] [Bug #2733](Rejected) rubyspec: Time#+ rounds micro seconds rather than  truncates FAILED
[ruby-dev:41021] [Bug #2777] Invalid read of size 4 by redefining load
[ruby-dev:41022] [Bug #3137] complex.rb changes exceptions of Math
[ruby-dev:41023] [Bug #3179] getc with text mode returns ASCII-8BIT
[ruby-dev:41024] [Bug #3180] getc with text mode breaks incomplete character immediately before EOF
[ruby-dev:41025] [Bug #2795] readpartial after ungetc fails with text mode
[ruby-dev:41026] [Bug #3030] make test-all fails with zlib 1.2.4
[ruby-dev:41027] [Bug #3033](Rejected) backtrace of SystemStackError disappeared
[ruby-dev:41028] [Bug #3030](Closed) make test-all fails with zlib 1.2.4
[ruby-dev:41029] [Bug #3179](Closed) getc with text mode returns ASCII-8BIT
[ruby-dev:41030] [Bug #3180](Closed) getc with text mode breaks incomplete character immediately before EOF
[ruby-dev:41031] [Bug #3182] multi-irb may run parallelly
[ruby-dev:41032] [Bug #21] should terminate @receiver_thread of Net::IMAP safely
[ruby-dev:41034] [Bug #527](Closed) test_execopts_pgroup(TestProcess) fails on NetBSD
[ruby-dev:41036] [Bug #821](Rejected) uninitialized constant Test::Unit::AutoRunner
[ruby-dev:41038] Windows と DL  が使用条件の libffi
[ruby-dev:41042] [Bug #825](Closed) Gem::Installer#generate_windows_script  の引数の順番が他と一致しない
[ruby-dev:41044] [Bug #3182](Closed) multi-irb may run parallelly
[ruby-dev:41045] [Bug #2342](Closed) bootstraptest/test_thread.rb  がまれに失敗する
[ruby-dev:41046] [Bug #2447] reduce GC pressure by symbol table without String instance
[ruby-dev:41047] [Bug #2425](Closed) Kernel#public_method  の例外メッセージ
[ruby-dev:41048] [Bug #2662](Rejected) BigDecimal#ceil, etc. should not return Integer
[ruby-dev:41049] [Bug #1807](Closed) r+  オープンしたファイルが MinGW  の拡張ライブラリで扱えない
[ruby-dev:41051] [Bug #1692] warning: useless use of a literal in void context
[ruby-dev:41052] [Bug #2795](Closed) readpartial after ungetc fails with text mode
[ruby-dev:41053] [Bug #2796](Closed) IO behaviors on mingw
[ruby-dev:41054] [Bug #3198] O_APPEND for redirect fd is ignored on windows
[ruby-dev:41058] [Bug #3198] O_APPEND for redirect fd is ignored on windows
[ruby-dev:41061] why did #rationalize removed?
[ruby-dev:41066] [Bug #1692](Closed) warning: useless use of a literal in void context
[ruby-dev:41067] [Feature #3203] LazySweepGC patch
[ruby-dev:41073] [Bug #982] stack level too deep for long Array initialization
[ruby-dev:41074] [Bug #2516](Rejected) IO#reopen Compatibility (original: )
[ruby-dev:41075] [Bug #2700](Rejected) various behavior when reopening File twice
[ruby-dev:41076] [Bug #2747](Rejected) io.dup doesn't handle pos properly
[ruby-dev:41077] [Bug #1919](Closed) sparc-solaris-2.10  で 1.9.2-preview1  がビルドできない
[ruby-dev:41078] [Bug #1967] Segmentation fault at test_qsort1 and test_qsort2 in test/dl/test_func.rb running on sparc-solaris-2.10
[ruby-dev:41079] [Bug #1804] ext/socket/mkconstants.rb doesn't recognize enum'ed constants
[ruby-dev:41080] [Bug #2386](Feedback) r25230 causes SEGV arround Marshal
[ruby-dev:41081] [Bug #2390](Closed) Marshal.dump pass a hidden object
[ruby-dev:41082] [Bug #2398] race condition of /#{ foo }/o
[ruby-dev:41083] [Bug #2398](Closed) race condition of /#{ foo }/o
[ruby-dev:41084] [Bug #1769] eval with binding, without location
[ruby-dev:41085] [Bug #1851] make install problems using mingw on fedora 11
[ruby-dev:41087] [Bug #1952] cannot stop with Ctrl+C
[ruby-dev:41088] Re: [ruby-core:27362] [Bug #2543] rdoc patch for thwait.rb
[ruby-dev:41089] [Bug #2386] r25230 causes SEGV arround Marshal
threads.html