40651-40931

40487-42066 threads.html 40902-41501
[ruby-dev:40651] nomap_table in emoji.trans
[ruby-dev:40654] [Feature #2968](Rejected)  数値の正負を返すメソッド
[ruby-dev:40655] [Bug #2965] method `===' called on hidden T_STRING object (NotImplementedError)
[ruby-dev:40657] [Feature #2968]  数値の正負を返すメソッド
[ruby-dev:40658] [Feature #2968]  数値の正負を返すメソッド
[ruby-dev:40660] [Feature #2968]  数値の正負を返すメソッド
[ruby-dev:40668] [Bug #2965] method `===' called on hidden T_STRING object (NotImplementedError)
[ruby-dev:40672] URI methods for application/x-www-form-urlencoded
[ruby-dev:40673] [Bug #2972] Windows  での gets(nil)
[ruby-dev:40674] [Bug #2972](Rejected) Windows  での gets(nil)
[ruby-dev:40679] cucumberの実行で高確率でSEGV
[ruby-dev:40681] [Bug #2581](Closed) require_relative depends on current directory
[ruby-dev:40683] [Bug #2388] test-all  中に popen  で ruby.exe  が落ちる
[ruby-dev:40686] [Bug #2965] method `===' called on hidden T_STRING object (NotImplementedError)
[ruby-dev:40687] [Feature #973] EncDet again
[ruby-dev:40688] [Feature #2571](Closed)  文字列のハミング距離
[ruby-dev:40689] [Bug #2976] cucumberでSEGV
[ruby-dev:40690] [Feature #2969](Closed) String#to_f  が -h.hhh±pd を解釈できるように
[ruby-dev:40693] [Bug #2976](Assigned)  cucumberでSEGV
[ruby-dev:40694] Ruby+SWIGでGC実行時に不正なマークをしている可能性があります
[ruby-dev:40695] keiju, please check tickets assigned to you
[ruby-dev:40696] [Feature #1596](Closed) GC.time
[ruby-dev:40697] [Feature #2360](Rejected) hide the internal of anonymous Enumerator
[ruby-dev:40698] [Bug #2976] cucumberでSEGV
[ruby-dev:40703] building ruby on mswin
[ruby-dev:40709] redmine (was Re:  Re: ...)
[ruby-dev:40714] [Feature #1374] location of already initialized constant
[ruby-dev:40716] [Bug #2987] typoの修正
[ruby-dev:40718] [Bug #2976] cucumberでSEGV
[ruby-dev:40725] [Feature #973] EncDet again
[ruby-dev:40730] [Bug #2727] make: *** [encdb.h] Aborted
[ruby-dev:40731] [Bug #2727] make: *** [encdb.h] Aborted
[ruby-dev:40733] [Bug #2727] make: *** [encdb.h] Aborted
[ruby-dev:40735] [Bug #2995] TestHash#test_recursive_check fails
[ruby-dev:40739] [Bug #2727] make: *** [encdb.h] Aborted
[ruby-dev:40742] [Bug #866](Rejected) gem(1) gemrc(5)
[ruby-dev:40743] [Bug #616](Closed) instance_eval and Module#to_s
[ruby-dev:40744] [Bug #3007] subtle inconsistency of Class#to_s
[ruby-dev:40746] [Bug #1031] -U  オプションの説明が --help  にない
[ruby-dev:40748] [Bug #953](Closed)  深い入れ子の配列の取り扱いで落ちる
[ruby-dev:40750] [Bug #1423](Closed) config.charset not found
[ruby-dev:40753] Re: -U  オプションの説明が --help  にない
[ruby-dev:40754] Socket::TCPServer.accept_nonblock accepts non blocking connections ERROR
[ruby-dev:40756] [Feature #1570](Rejected)  「unless インスタンス変数」での警告について
[ruby-dev:40758] [Bug #2703](Closed) make test failed
[ruby-dev:40760] [Feature #2695] Supported Platforms
[ruby-dev:40765] [Bug #843](Closed) RubyGems include useless libraries
[ruby-dev:40766] [Bug #825] Gem::Installer#generate_windows_script  の引数の順番が他と一致しない
[ruby-dev:40772] [Feature #1269] warning when Kernel#p is used
[ruby-dev:40774] [Bug #2995](Closed) TestHash#test_recursive_check fails
[ruby-dev:40779] [Feature #3018] UNINITIALIZED_VAR()  マクロの導入
[ruby-dev:40798] [Bug #2604] test_dsa_sign_verify() in test/openssl/test_ec.rb failes
[ruby-dev:40802] [Bug #3030] make test-all fails with zlib 1.2.4
[ruby-dev:40805] Improvement of Fiber switching cost with system dependent way
[ruby-dev:40809] [Bug:trunk] backtrace of SystemStackError disappeared
[ruby-dev:40829] [Feature #3036] String#encode(to, from, opt)  の opt[:replace]  に Hash
[ruby-dev:40830] [Bug #3037] testrb  の動作が1.8.7 の testrb  と違いすぎる
[ruby-dev:40832] Process.daemon() returns -1 on failure ifndef HAVE_DAEMON
[ruby-dev:40833] [Bug: trunk] Fiber transfer limitation
[ruby-dev:40850] [Feature #2442] [irb] interactive help
[ruby-dev:40852] [Bug #3055] NEWS: URI Obsoleted methods
[ruby-dev:40853] [Bug #3055] NEWS: URI Obsoleted methods
[ruby-dev:40854] [Bug #3055](Closed) NEWS: URI Obsoleted methods
[ruby-dev:40855] revert 1.9 \w limitation to ASCII
[ruby-dev:40857] [Feature #2695] Supported Platforms
[ruby-dev:40861] [Feature #2673] the length for an enumerator generated by Array#permutation and Array#combination
[ruby-dev:40862] [Feature #2674] RubyVM::InstructionSequence to accept IOs
[ruby-dev:40870] [Feature #2674] RubyVM::InstructionSequence to accept IOs
[ruby-dev:40873] [Bug #2604] test_dsa_sign_verify() in test/openssl/test_ec.rb failes
[ruby-dev:40875] [Bug #2604] test_dsa_sign_verify() in test/openssl/test_ec.rb failes
[ruby-dev:40877] [Bug #2965] method `===' called on hidden T_STRING object (NotImplementedError)
[ruby-dev:40879] [Feature #3036] String#encode(to, from, opt)  の opt[:replace]  に Hash
[ruby-dev:40880] [Feature #2471](Open) want to choose a GC algorithm
[ruby-dev:40881] [Bug #3064] TypedDataについてのドキュメントがない
[ruby-dev:40882] [Feature #2673] the length for an enumerator generated by Array#permutation and Array#combination
[ruby-dev:40884] [Feature #3065] [TypedData]  という名前について
[ruby-dev:40886] [Feature #3066] [TypedData] wrap_struct_name  は必要?
[ruby-dev:40889] [Feature #3068] [TypedData] RUBY_TYPED_DEFAULT_FREE  は必要?
[ruby-dev:40890] [Feature #3069] [TypedData]  関連APIの名前が不揃い
[ruby-dev:40897] [Feature:1.9] io/console
threads.html