40280-41840

40123-41365 threads.html 40487-42066
[ruby-dev:40280] [Bug #2697](Rejected) rubyspec: StringIO#ungetc when passed [char] tries to  convert the passed length to an Integer using #to_int ERROR
[ruby-dev:40281] [Bug #2703] make test failed
[ruby-dev:40282] [Bug #2700](Assigned) various behavior when reopening File twice
[ruby-dev:40284] [Bug #2537](Closed)  継承クラスにて、ブロック内にてsuperを呼ぶと、super called outside of method  (NoMethodError)が発生する
[ruby-dev:40289] [Bug #1954] line number 0?
[ruby-dev:40290] [Feature #2687](Closed) rubyspec: Vector.each2 given one argument returns  self when given a block FAILED
[ruby-dev:40293] [Bug #2704] CGI::rfc1123_date causes NameError
[ruby-dev:40296] nkf MINE encoding bug
[ruby-dev:40297] [Bug #1977](Closed) test failed in test_isdigit in test/dl/test_func.rb on sparc-solaris-2.10 (64bit)
[ruby-dev:40298] Re: [ruby-cvs:33760] Ruby:r26545 (trunk): Wed Feb 3 10:12:09 2010  Aaron Patterson <tenderlove@ruby-lang.org>
[ruby-dev:40305] What purpose is Net::FTP#last_response for?
[ruby-dev:40309] Why can't we use get_stack()
[ruby-dev:40312] [Bug #2679](Closed) rubyspec: SimpleDelegator when frozen creates a frozen  clone ERROR
[ruby-dev:40314] [Bug #2679](Open) rubyspec: SimpleDelegator when frozen creates a frozen  clone ERROR
[ruby-dev:40315] [Backport #2463](Closed) String#center
[ruby-dev:40317] [Bug:trunk] TCPServer#gets gets stuck
[ruby-dev:40318] [Bug #2661](Closed) Bignum <= BigDecimal("NaN") raises an Exception
[ruby-dev:40321] [Bug #2575] a test fail for IO#readpartial is broken on *BSD
[ruby-dev:40328] [Bug #2575] a test fail for IO#readpartial is broken on *BSD
[ruby-dev:40333] [Bug #2696](Closed) rubyspec: StringIO#ungetc when passed [char] pads with  \000 when the current position is after the end ERROR
[ruby-dev:40334] [Bug #2716] make main is stopped by error in compile_prelude.rb
[ruby-dev:40335] [Bug #2716] make main is stopped by error in compile_prelude.rb
[ruby-dev:40336] [Bug #2716] make main is stopped by error in compile_prelude.rb
[ruby-dev:40337] [Feature #2693](Closed) unfriendly exception when command executed for Net::FTP which is not connected
[ruby-dev:40354] [Bug #2724] fork from other than the main thread causes wrong pthread condition on NetBSD
[ruby-dev:40359] trunk \w match
[ruby-dev:40373] [Bug #2712](Closed) TCPServer#gets gets stuck
[ruby-dev:40377] [Bug #2727] make: *** [encdb.h] Aborted
[ruby-dev:40379] rubyspec: File.new raises an Errno::EINVAL error with File::APPEND  FAILED
[ruby-dev:40382] [Bug:trunk] rubyspec: ObjectSpace.define_finalizer doesn't call  self-referencing finalizers FAILED
[ruby-dev:40384] [Bug:trunk] rubyspec: Time#+ rounds micro seconds rather than  truncates FAILED
[ruby-dev:40386] [bug:trunk] regexp marshal problem from 1.9.1 to 1.9.2
[ruby-dev:40387] [Bug #2516] IO#reopen Compatibility (original: )
[ruby-dev:40388] [bug:trunk] marshal changes ["foo", "bar", "bar"] to ["foo", "bar",  "EUC-JP"]
[ruby-dev:40395] [Bug #2735] miniruby make failed on powerpc-darwin9.8.0
[ruby-dev:40396] [Bug #2735](Closed) miniruby make failed on powerpc-darwin9.8.0
[ruby-dev:40414] Re: [ruby-cvs:33873] Ruby:r26658 (trunk): * marshal.c (id2encidx):  duplicated entry for encoding name.
[ruby-dev:40418] [Feature #2746]  ビルドする拡張ライブラリを configure  時に指定するための --with-exts  オプション
[ruby-dev:40424] [Bug #2747] io.dup doesn't handle pos properly
[ruby-dev:40425] [Bug #2747] io.dup doesn't handle pos properly
[ruby-dev:40426] [Bug #2747] io.dup doesn't handle pos properly
[ruby-dev:40428] [Bug #2747] io.dup doesn't handle pos properly
[ruby-dev:40429] Re: [Bug #2516] IO#reopen Compatibility 
[ruby-dev:40430] [Bug #2748] fix for READ_CHECK causes failures on FreeBSD 8.0
[ruby-dev:40436] [Bug #2732](Closed) rubyspec: ObjectSpace.define_finalizer doesn't call  self-referencing finalizers FAILED
[ruby-dev:40439] [Bug #2752] File path encoding on mac os x and windows
[ruby-dev:40440] repeat of DRb.start_service and DRb.stop_service may result in  EADDRINUSE
[ruby-dev:40449] [Bug:trunk] gem install cairo fails
[ruby-dev:40450] [Bug #2769](Closed) gem install cairo fails
[ruby-dev:40451] [Bug:trunk] add explicit constraints for WONTFIX IO bug
[ruby-dev:40452] [bug:trunk] Invalid read of size 4 by redefining load
[ruby-dev:40453] [Bug #2776] can't return from lambda with outer block
[ruby-dev:40454] [Bug #2776] can't return from lambda with outer block
[ruby-dev:40461] respond_to?(<protected method name>) returns true
[ruby-dev:40467] Re: [ruby-cvs:33954] Ruby:r26739 (trunk): * ext/openssl/ossl_digest.c (GetDigestPtr): Allow to pass the
[ruby-dev:40471] improving handling of reserved names in OpenStruct
[ruby-dev:40474] [Bug #2787] nil.instance_eval pushes nil onto cref
[ruby-dev:40475] [Bug #2787](Closed) nil.instance_eval pushes nil onto cref
[ruby-dev:40476] shell.rb warnings
[ruby-dev:40481] [ANN] Ruby 1.9.2dev has passed RubySpec!
threads.html