40902-41501

40651-40931 subjects 41092-41478

[Feature #2969] String#to_f  が -h.hhh±pd を解釈できるように
40902 [redmine@ru y] チケット #2969 が更新されました。 (by Yuki Sonoda)

[Bug #1234](Closed) RDoc failure in benchmark/bm_so_meteor_contest.rb at or around line 542 column
40903 [redmine@ru y] チケット #1234 が更新されました。 (by Eric Hodel)

Benchmark::Tms#add!がNameErrorになる
40906 [takky818@gm ] % ruby -v -r benchmark -e 'Benchmark::Tms.new.add! {}'

[Bug:trunk] test_float_hex failure
40908 [akr@fs j. rg] test_float_hex が失敗しています。

test_float_hex failure [test/ruby/test_sprintf.rb:202]
40909 [akr@fs j. rg] 以下のように test_sprintf.rb が失敗します。

overflow of time on FreeBSD
40910 [naruse@ai em] FreeBSD で以下のテストが失敗します。

iseq_s_load が filepath  の指定のない ISeq  で TypeError  発生
40911 [nagachika00@] ISeq で非公開の iseq_s_load を使って遊んでいて気がついたのですが、

[Bug #1582](Closed) IO.new Raises Other Errors between 1.8 and 1.9
40912 [redmine@ru y] チケット #1582 が更新されました。 (by _ wanabe)

[Bug #3064](Rejected)  TypedDataについてのドキュメントがない
40913 [redmine@ru y] チケット #3064 が更新されました。 (by Yui NARUSE)

1.9.2 spec has been frozen
40914 [zn@mb .n ft ] 遠藤さんの作成した一覧に従って Feature チケットのうち合意に
+ 40915 [usa@ga ba ec] お疲れ様です。
+ 40916 [naruse@ai em] メンテナはいませんね。

テスト対象を 2 つ指定すると落ちる
40917 [ksmakoto@dd ] amd64 FreeBSD8 で、ruby は trunk です。ビルド用のディレクトリを掘って
40918 [shyouhei@ru ] んー、Linuxで申し訳ありませんが、私の手元の環境だと落ちないですね。-O0だからか?
40919 [ksmakoto@dd ] GC の中でした
40920 [naruse@ai em] 手元の FreeBSD8 amd64 ruby-trunk だと -O0 でも -O3 でも再現しませんね。
40921 [ksmakoto@dd ] 試してみたところ CFLAGS を設定して configure すると回避するようです。

[Bug #2724] fork from other than the main thread causes wrong pthread condition on NetBSD
40922 [redmine@ru y] チケット #2724 が更新されました。 (by Michael Graff)

[Bug #2724] fork from other than the main thread causes wrong pthread condition on NetBSD
40923 [redmine@ru y] チケット #2724 が更新されました。 (by Usaku NAKAMURA)

[Feature #3018](Closed) UNINITIALIZED_VAR()  マクロの導入
40924 [redmine@ru y] チケット #3018 が更新されました。 (by Motohiro KOSAKI)

[Bug #3107] AIXで--with-opt-dir
40926 [redmine@ru y] Bug #3107: AIXで--with-opt-dir

[Bug #3108] locationが初期化前に参照されて落ちます。
40927 [redmine@ru y] Bug #3108: locationが初期化前に参照されて落ちます。

[Feature #2674] RubyVM::InstructionSequence to accept IOs
40928 [redmine@ru y] チケット #2674 が更新されました。 (by Yusuke Endoh)

[Feature #3069](Rejected) [TypedData]  関連APIの名前が不揃い
40929 [redmine@ru y] チケット #3069 が更新されました。 (by Yusuke Endoh)

[Feature #2674] RubyVM::InstructionSequence to accept IOs
40930 [redmine@ru y] チケット #2674 が更新されました。 (by Shyouhei Urabe)

[Feature #2442](Closed) [irb] interactive help
40932 [redmine@ru y] チケット #2442 が更新されました。 (by Nobuyoshi Nakada)

[Bug #1191] Net::IMAP.encode_utf7 bug?
40933 [redmine@ru y] チケット #1191 が更新されました。 (by Yusuke Endoh)

[Bug #1270](Closed) FileUtils.chown:  グループを数値指定するとTypeError
40934 [redmine@ru y] チケット #1270 が更新されました。 (by Yusuke Endoh)

[Bug #1969] irb will be stuck with long variable name with completion.rb
40935 [redmine@ru y] チケット #1969 が更新されました。 (by Yusuke Endoh)
40944 [keiju@is it ] will be stuck with long variable name with completion.rb", on Apr/08
40945 [mame@ts .n .] おお、たぶん大丈夫そうに見えます。ありがとうございます。

[Bug #1952](Open) cannot stop with Ctrl+C
40936 [redmine@ru y] チケット #1952 が更新されました。 (by Yusuke Endoh)
40981 [usa@ga ba ec] 元の再現コードはCtrl+C(=Interrupt)を潰していません。
40994 [mame@ts .n .] 全く同じではないですが、「終了しろー」という例外を潰している

[Bug #2965](Closed) method `===' called on hidden T_STRING object (NotImplementedError)
40937 [redmine@ru y] チケット #2965 が更新されました。 (by Kenta Murata)

URI.decode_www_form("?a=b")
40938 [akr@fs j. rg] URI.decode_www_form は、引数の先頭にある ? を無視します。
40950 [naruse@ai em] どこかで form data の POST 時に ? を含めてしまう実装があるとか見たような

[Bug #2821](Closed) Dir.[] returns unmatched path
40941 [redmine@ru y] チケット #2821 が更新されました。 (by Yusuke Endoh)

[Bug #1615](Feedback)  添付ライブラリを使って巨大なCSVファイルを書き出すときにインタープリタがSegmentation Faultを起こす
40946 [redmine@ru y] チケット #1615 が更新されました。 (by Yusuke Endoh)

[Bug #3108](Closed) locationが初期化前に参照されて落ちます。
40947 [redmine@ru y] チケット #3108 が更新されました。 (by _ wanabe)

[Bug #595] Fiber ignores ensure clause
40948 [redmine@ru y] チケット #595 が更新されました。 (by _ wanabe)
41035 [mame@ts .n .] ささださんではないですが勝手にコメントします。
41037 [ko1@at ot ne]  返事が出来ていなくてすみません.最近,色々と余裕がなくて,じっくり考え

lib/uri/common.rb:720:16: Unrecognized directive 'nodoc'
40949 [akr@fs j. rg] rdoc で、以下のようなメッセージが出ています。
40952 [naruse@ai em] 定数を nodoc にするには、末尾につける必要があったようです。

[Bug #3123] uninitialized constant Object::C (NameError)
40951 [redmine@ru y] Bug #3123: uninitialized constant Object::C (NameError)

[Bug #3126] irb/completionでTypeError
40953 [redmine@ru y] Bug #3126: irb/completionでTypeError
40965 [keiju@is it ] 申し訳ない. コミットしました.

[Bug #3127] Encoding#replicate(non_string)
40954 [redmine@ru y] Bug #3127: Encoding#replicate(non_string)

[Bug #3127](Closed) Encoding#replicate(non_string)
40955 [redmine@ru y] チケット #3127 が更新されました。 (by Nobuyoshi Nakada)

[Bug #3107](Closed) AIXで--with-opt-dir
40956 [redmine@ru y] チケット #3107 が更新されました。 (by Yutaka Kanemoto)

[Bug #2727](Third Party's Issue) make: *** [encdb.h] Aborted
40957 [redmine@ru y] チケット #2727 が更新されました。 (by Yusuke Endoh)

[Bug #2652](Closed) three bugs of Matrix::Scalar
40958 [redmine@ru y] チケット #2652 が更新されました。 (by Yusuke Endoh)

[Bug #3136] reuse of singleton method definition causes SEGV
40959 [redmine@ru y] Bug #3136: reuse of singleton method definition causes SEGV

[Bug #2651](Closed) Matrix#compare_by_row_vectors does not receive array of  Vector
40960 [redmine@ru y] チケット #2651 が更新されました。 (by Marc-Andre Lafortune)

[Bug #3137] complex.rb changes exceptions of Math
40961 [redmine@ru y] Bug #3137: complex.rb changes exceptions of Math
40967 [keiju@is it ] In the message: "[Bug #3137] complex.rb changes exceptions of Math",
40968 [matz@ru y- a] そう? nil渡して「nilじゃダメ」と言われてるんだから明確でな
40969 [keiju@is it ] def exp(z)
40970 [matz@ru y- a] そうかなあ。そのまま、「real?がない」でいいんじゃないですかね。
40971 [keiju@is it ] それは, 現行の状態です. そうじゃなくて, Mathと同じ上記の例外にしろって
40972 [matz@ru y- a] うーん、私は中立です。まあ、Floatをかませずにオリジナルのexp
40974 [mame@ts .n .] エラーメッセージの問題ではなく、例外クラスが変わることだと思い
+ 40976 [akr@fs j. rg] もし継承したとすると、メソッド名の間違いが TypeError で rescue されて、
+ 40983 [keiju@is it ] うーん. 言いたいことは分からなくはないですが...
  40988 [mame@ts .n .] えっ、あれっ、cmath.rb のメンテナはいしつかさんだと思っていた
  40998 [ruby-core-ma] I'll gladly maintain cmath if it can help.

[Bug #3137] complex.rb changes exceptions of Math
40962 [redmine@ru y] チケット #3137 が更新されました。 (by Marc-Andre Lafortune)

[Bug #3137] complex.rb changes exceptions of Math
40963 [redmine@ru y] チケット #3137 が更新されました。 (by Yusuke Endoh)

[Feature #3036](Closed) String#encode(to, from, opt)  の opt[:replace]  に Hash
40964 [redmine@ru y] チケット #3036 が更新されました。 (by Yui NARUSE)

[Bug #3126](Closed) irb/completionでTypeError
40966 [redmine@ru y] チケット #3126 が更新されました。 (by Keiju Ishitsuka)

[BUG: trunk]arm-linux向けクロスコンパイル時のエラー
40973 [shiba@rv .j ] i686-linuxからarm-linux向けにクロスコンパイルをしようとしたところ,
40984 [nobu@ru y- a] これは以下のようにしても通りますか?
40995 [shiba@rv .j ] trunkが上記のように変更されていたので,ビルドしてみたところ,

[Bug #3141] yield in an eigenclass definition
40975 [redmine@ru y] Bug #3141: yield in an eigenclass definition

[Bug #812] Failure: test_priority (TestThread) on mswin32
40977 [redmine@ru y] チケット #812 が更新されました。 (by Yusuke Endoh)
40980 [usa@ga ba ec] もちろん本当なので動きそうなのですが、なんでだろう、というの

[Bug #924] encoding for stdio's
40978 [redmine@ru y] チケット #924 が更新されました。 (by Yusuke Endoh)

[Bug #1031] -U  オプションの説明が --help  にない
40979 [redmine@ru y] チケット #1031 が更新されました。 (by Yusuke Endoh)

[Bug #1191] Net::IMAP.encode_utf7 bug?
40982 [redmine@ru y] チケット #1191 が更新されました。 (by Shugo Maeda)

[Bug #924](Closed) encoding for stdio's
40985 [redmine@ru y] チケット #924 が更新されました。 (by Yui NARUSE)

[Bug #3145](Closed) arm-linux向けクロスコンパイル時のエラー
40986 [redmine@ru y] チケット #3145 が更新されました。 (by Nobuyoshi Nakada)

[Bug #1676](Closed) only last "return" is traced by set_trace_func
40987 [redmine@ru y] チケット #1676 が更新されました。 (by Yusuke Endoh)

[Bug #3146] ERB single line comment does not work
40989 [redmine@ru y] Bug #3146: ERB single line comment does not work
40990 [m_seki@mv .b] いつもみなさんに迷惑をかけてしまって申し訳なく思ってます。
40991 [mame@ts .n .] いえ、楽しいからやってるだけですので。

Mac OS X の ruby 1.9.1p378 で再 open  後 delete した Tempfile が closed stream  になる
40992 [ksmakoto@dd ] trunk に残っているかどうかわかりませんが、MacPorts の ruby 1.9 で

[Backport #3149] Mac OS X  の ruby 1.9.1p378 で再 open  後 delete  した Tempfile が closed stream  になる
40993 [redmine@ru y] Backport #3149: Mac OS X の ruby 1.9.1p378 で再 open 後 delete した Tempfile が closed stream になる

[RubySpec #3154] Hidden allocate, new and superclass methods on 1.9.2
40996 [redmine@ru y] RubySpec #3154: Hidden allocate, new and superclass methods on 1.9.2

[RubySpec #3154] Hidden allocate, new and superclass methods on 1.9.2
40997 [redmine@ru y] チケット #3154 が更新されました。 (by Yusuke Endoh)

[Bug #2074] json  の j  や jj  は module_function  にするべき?
40999 [redmine@ru y] チケット #2074 が更新されました。 (by Yusuke Endoh)

[Bug #1191](Closed) Net::IMAP.encode_utf7 bug?
41000 [redmine@ru y] チケット #1191 が更新されました。 (by Yusuke Endoh)

[Bug #1969](Closed) irb will be stuck with long variable name with completion.rb
41001 [redmine@ru y] チケット #1969 が更新されました。 (by Yusuke Endoh)

[Bug #2374](Rejected) URI.regexp('http')  が 'http://'  にマッチする
41003 [redmine@ru y] チケット #2374 が更新されました。 (by Yusuke Endoh)

[Bug #1788] ある種のメソッドをalias_methodしようとすると落ちる
41004 [redmine@ru y] チケット #1788 が更新されました。 (by James Byrne)

[Bug #2226](Closed) case   文の式が省略され when  節に配列展開があるときの挙動
41005 [redmine@ru y] チケット #2226 が更新されました。 (by _ wanabe)

[Bug #1788] ある種のメソッドをalias_methodしようとすると落ちる
41006 [redmine@ru y] チケット #1788 が更新されました。 (by Yusuke Endoh)

[Bug #3136] reuse of singleton method definition causes SEGV
41007 [redmine@ru y] チケット #3136 が更新されました。 (by Yusuke Endoh)

[Bug #2402] super in instance_eval
41008 [redmine@ru y] チケット #2402 が更新されました。 (by Yusuke Endoh)

[Bug #3136] reuse of singleton method definition causes SEGV
41009 [redmine@ru y] チケット #3136 が更新されました。 (by Yusuke Endoh)

[Bug #3168] TypeError in Timeout.timeout
41010 [redmine@ru y] Bug #3168: TypeError in Timeout.timeout

[Bug #3170] timeout() does'nt work with Non Integer/Float Argument
41011 [redmine@ru y] Bug #3170: timeout() does'nt work with Non Integer/Float Argument

[Bug #3168](Closed) TypeError in Timeout.timeout
41012 [redmine@ru y] チケット #3168 が更新されました。 (by Nobuyoshi Nakada)

[Bug #2976] cucumberでSEGV
41013 [redmine@ru y] チケット #2976 が更新されました。 (by Sakuro OZAWA)

[Bug #2976](Closed) cucumberでSEGV
41014 [redmine@ru y] チケット #2976 が更新されました。 (by Yui NARUSE)

[Bug #3170] timeout() does'nt work with Non Integer/Float Argument
41015 [redmine@ru y] チケット #3170 が更新されました。 (by Kyosuke MOROHASHI)

[Bug #2688](Closed) rubyspec: Net::HTTPHeader#content_range returns a Range  object that represents the 'Content-Range' header entry FAILED
41016 [redmine@ru y] チケット #2688 が更新されました。 (by Yusuke Endoh)

[Bug #2704] CGI::rfc1123_date causes NameError
41017 [redmine@ru y] チケット #2704 が更新されました。 (by Yusuke Endoh)

[Bug #3177] TestFileUtils#test_cp_r_symlink
41018 [redmine@ru y] Bug #3177: TestFileUtils#test_cp_r_symlink
41020 [mame@ts .n .] 時系列から見て、テストの直し忘れなんでしょうね。

[Bug #2733](Rejected) rubyspec: Time#+ rounds micro seconds rather than  truncates FAILED
41019 [redmine@ru y] チケット #2733 が更新されました。 (by Yusuke Endoh)

[Bug #2777] Invalid read of size 4 by redefining load
41021 [redmine@ru y] チケット #2777 が更新されました。 (by Yusuke Endoh)

[Bug #3137] complex.rb changes exceptions of Math
41022 [redmine@ru y] チケット #3137 が更新されました。 (by tadayoshi funaba)

[Bug #3179] getc with text mode returns ASCII-8BIT
41023 [redmine@ru y] Bug #3179: getc with text mode returns ASCII-8BIT
41033 [matz@ru y- a] 私のところでは"あ" "い" "う"が返りますね。

[Bug #3180] getc with text mode breaks incomplete character immediately before EOF
41024 [redmine@ru y] Bug #3180: getc with text mode breaks incomplete character immediately before EOF

[Bug #2795] readpartial after ungetc fails with text mode
41025 [redmine@ru y] チケット #2795 が更新されました。 (by Yusuke Endoh)

[Bug #3030] make test-all fails with zlib 1.2.4
41026 [redmine@ru y] チケット #3030 が更新されました。 (by Yusuke Endoh)

[Bug #3033](Rejected) backtrace of SystemStackError disappeared
41027 [redmine@ru y] チケット #3033 が更新されました。 (by Yusuke Endoh)

[Bug #3030](Closed) make test-all fails with zlib 1.2.4
41028 [redmine@ru y] チケット #3030 が更新されました。 (by Yusuke Endoh)

[Bug #3179](Closed) getc with text mode returns ASCII-8BIT
41029 [redmine@ru y] チケット #3179 が更新されました。 (by Yui NARUSE)

[Bug #3180](Closed) getc with text mode breaks incomplete character immediately before EOF
41030 [redmine@ru y] チケット #3180 が更新されました。 (by Yui NARUSE)

[Bug #3182] multi-irb may run parallelly
41031 [redmine@ru y] Bug #3182: multi-irb may run parallelly
41043 [keiju@is it ] 確かに.

[Bug #21] should terminate @receiver_thread of Net::IMAP safely
41032 [redmine@ru y] チケット #21 が更新されました。 (by Yusuke Endoh)

[Bug #527](Closed) test_execopts_pgroup(TestProcess) fails on NetBSD
41034 [redmine@ru y] チケット #527 が更新されました。 (by Yui NARUSE)

[Bug #821](Rejected) uninitialized constant Test::Unit::AutoRunner
41036 [redmine@ru y] チケット #821 が更新されました。 (by Yusuke Endoh)

Windows と DL  が使用条件の libffi
41038 [aaron.patter] Windowsで libffiとDL用の定義修正が完了しました。
41039 [usa@ga ba ec] このあたりがよくわかりませんが、
+ 41040 [naruse@ai em] libffi-msvc だと libffi.lib と libffi.h ができるのを、
| + 41050 [usa@ga ba ec] バイナリであるかそうでないかは別に問わないですが、少なくとも
| + 41059 [aaron.patter] はい、既に全てのテストの実行の確認済みです。
|   41060 [yugui@yu ui ] Great!
|   41072 [aaron.patter] I believe that is correct, but the patches have been merged to FFI.
|   41149 [yugui@yu ui ] Sorry for replying so late.
|   41152 [usa@ga ba ec] I've not tested it yet by various individual reasons.
|   + 41170 [yugui@yu ui ] OK. Could you do that, Aaron?  After done, I will create ruby_1_9_2 branch.
|   + 41171 [yugui@yu ui ] OK. Could you do that, Aaron?  After done, I will create ruby_1_9_2 branch.
|   | 41180 [aaron.patter] Yes.  r27640.  Thank you for waiting.
|   | 41214 [akr@fs j. rg] After fiddle is added, test-all dumps core on GNU/Linux (i386).
|   | 41269 [aaron.patter] 以下の詳細が不明ですので、答える事が出来ません。詳しい情報をお願いします。
|   | 41270 [akr@fs j. rg] core を吐いています。
|   + 41179 [aaron.patter] MjAxMC81LzQgVS5OYWthbXVyYSA8dXNhQGdhcmJhZ2Vjb2xsZWN0LmpwPjoKPiAbJEIkMyRzJEsk
+ 41041 [aaron.patter] なかむら(う)さんのコメントにあったので、簡単に説明します。

[Bug #825](Closed) Gem::Installer#generate_windows_script  の引数の順番が他と一致しない
41042 [redmine@ru y] チケット #825 が更新されました。 (by Eric Hodel)

[Bug #3182](Closed) multi-irb may run parallelly
41044 [redmine@ru y] チケット #3182 が更新されました。 (by Keiju Ishitsuka)

[Bug #2342](Closed) bootstraptest/test_thread.rb  がまれに失敗する
41045 [redmine@ru y] チケット #2342 が更新されました。 (by Yusuke Endoh)

[Bug #2447] reduce GC pressure by symbol table without String instance
41046 [redmine@ru y] チケット #2447 が更新されました。 (by Yusuke Endoh)

[Bug #2425](Closed) Kernel#public_method  の例外メッセージ
41047 [redmine@ru y] チケット #2425 が更新されました。 (by Yusuke Endoh)

[Bug #2662](Rejected) BigDecimal#ceil, etc. should not return Integer
41048 [redmine@ru y] チケット #2662 が更新されました。 (by Yusuke Endoh)

[Bug #1807](Closed) r+  オープンしたファイルが MinGW  の拡張ライブラリで扱えない
41049 [redmine@ru y] チケット #1807 が更新されました。 (by Usaku NAKAMURA)

[Bug #1692] warning: useless use of a literal in void context
41051 [redmine@ru y] チケット #1692 が更新されました。 (by Yusuke Endoh)

[Bug #2795](Closed) readpartial after ungetc fails with text mode
41052 [redmine@ru y] チケット #2795 が更新されました。 (by Akira Tanaka)

[Bug #2796](Closed) IO behaviors on mingw
41053 [redmine@ru y] チケット #2796 が更新されました。 (by Akira Tanaka)

[Bug #3198] O_APPEND for redirect fd is ignored on windows
41054 [redmine@ru y] Bug #3198: O_APPEND for redirect fd is ignored on windows
41055 [kosaki.motoh] 根本原因はなんなのでしょうか?
41056 [usa@ga ba ec] fdに付随したフラグは子プロセスに受け継がれません。
41057 [kosaki.motoh] ああ、なるほど。なっとく。すいません空気読めてませんでした

[Bug #3198] O_APPEND for redirect fd is ignored on windows
41058 [redmine@ru y] チケット #3198 が更新されました。 (by _ wanabe)

why did #rationalize removed?
41061 [mame@ts .n .] Rational#rationalize を始め、多くの #rationalize メソッドが削除
41062 [tadf@do rb o] 結果として現状のまま残してよいという確信が持てない、というのが理由です。
41063 [mame@ts .n .] 心配されているのは実装上のバグでしょうか。
41064 [tadf@do rb o] 念の為、考えた事を書いておきますが、元々 cmath.rb あたりも含めて自分の
41065 [mame@ts .n .] このあたりの経緯をわかっていなかったのですが、[ruby-dev:39724] の

[Bug #1692](Closed) warning: useless use of a literal in void context
41066 [redmine@ru y] チケット #1692 が更新されました。 (by Yusuke Endoh)

[Feature #3203] LazySweepGC patch
41067 [redmine@ru y] Feature #3203: LazySweepGC patch
+ 41068 [matz@ru y- a] コミットしちゃっていいんじゃないですかね。
+ 41069 [mame@ts .n .] 有用かはわかりませんが、make benchmark の結果くらいは確認して欲しいです。
  41070 [naruse@ai em] make test-all の所要時間と、make test-rubyspec の所要時間とか (結果も)、
  41071 [authornari@g] ありがとうございます。調べてみます。
  41443 [authornari@g] make test-rubyspec、check、benchmarkが通るようなりました。
  + 41444 [kosaki.motoh] 個人的意見ですが
  + 41446 [matz@ru y- a] コミットしちゃって。
  + 41456 [akr@fs j. rg] 思い立って、GC.stress を true にしてテストを動かしてみました。
    + 41457 [authornari@g] ご指摘ありがとうございます。
    | 41459 [mame@ts .n .] akr さんの件は無実でした (というか [Bug #3241] でパッチ作成済み
    | 41464 [akr@fs j. rg] そうでしたか。
    | 41491 [ksmakoto@dd ] 手元の環境だと以下のエラーが出てます。
    | 41501 [akr@fs j. rg] これ、いろんなところで出ますねぇ。
    + 41458 [mame@ts .n .] ということを考えると、テストフレームワークは極限まで単純な方がいいですねえ。

[Bug #982] stack level too deep for long Array initialization
41073 [redmine@ru y] チケット #982 が更新されました。 (by Yusuke Endoh)

[Bug #2516](Rejected) IO#reopen Compatibility (original: )
41074 [redmine@ru y] チケット #2516 が更新されました。 (by Yusuke Endoh)

[Bug #2700](Rejected) various behavior when reopening File twice
41075 [redmine@ru y] チケット #2700 が更新されました。 (by Yusuke Endoh)

[Bug #2747](Rejected) io.dup doesn't handle pos properly
41076 [redmine@ru y] チケット #2747 が更新されました。 (by Yusuke Endoh)

[Bug #1919](Closed) sparc-solaris-2.10  で 1.9.2-preview1  がビルドできない
41077 [redmine@ru y] チケット #1919 が更新されました。 (by Yusuke Endoh)

[Bug #1967] Segmentation fault at test_qsort1 and test_qsort2 in test/dl/test_func.rb running on sparc-solaris-2.10
41078 [redmine@ru y] チケット #1967 が更新されました。 (by Yusuke Endoh)
41271 [aaron.patter] ffiは x86_64 をsupportしているので、ffi に同じような問題はないと思います。

[Bug #1804] ext/socket/mkconstants.rb doesn't recognize enum'ed constants
41079 [redmine@ru y] チケット #1804 が更新されました。 (by Yusuke Endoh)

[Bug #2386](Feedback) r25230 causes SEGV arround Marshal
41080 [redmine@ru y] チケット #2386 が更新されました。 (by Yusuke Endoh)
41086 [keiju@is it ] #2386](Feedback) r25230 causes SEGV arround Marshal", on Apr/27

[Bug #2390](Closed) Marshal.dump pass a hidden object
41081 [redmine@ru y] チケット #2390 が更新されました。 (by Yusuke Endoh)

[Bug #2398] race condition of /#{ foo }/o
41082 [redmine@ru y] チケット #2398 が更新されました。 (by Yusuke Endoh)

[Bug #2398](Closed) race condition of /#{ foo }/o
41083 [redmine@ru y] チケット #2398 が更新されました。 (by Yusuke Endoh)

[Bug #1769] eval with binding, without location
41084 [redmine@ru y] チケット #1769 が更新されました。 (by Yusuke Endoh)

[Bug #1851] make install problems using mingw on fedora 11
41085 [redmine@ru y] チケット #1851 が更新されました。 (by Kazuhiro NISHIYAMA)

[Bug #1952] cannot stop with Ctrl+C
41087 [redmine@ru y] チケット #1952 が更新されました。 (by Yusuke Endoh)

Re: [ruby-core:27362] [Bug #2543] rdoc patch for thwait.rb
41088 [mame@ts .n .] Keiju, why don't you import Roger's patch?
41090 [keiju@is it ] [ruby-core:27362] [Bug #2543] rdoc patch for thwait.rb", on Apr/28
41091 [mame@ts .n .] 了解しました。

[Bug #2386] r25230 causes SEGV arround Marshal
41089 [redmine@ru y] チケット #2386 が更新されました。 (by Yusuke Endoh)
threads.html
top