ruby_dev (40201-40400)

 < ^ > 
40201 10/01/28 12:43:40 [muraken gmail.c] Re: [Feature #2673] the length for an enumerator generated by Array#permutation and Array#combination
40202 10/01/28 19:36:11 [shyouhei ruby-l] [Feature:trunk] RubyVM::InstructionSequence to accept IOs
40203 10/01/28 20:24:21 [mame tsg.ne.jp ] Re: [Bug #2662] BigDecimal#ceil, etc. should not return Integer
40204 10/01/28 20:26:45 [mame tsg.ne.jp ] Re: [Bug:1.8] compatibility issue of BigDecimal#** and #power
40205 10/01/28 20:39:29 [kou cozmixng.or] Re: [Bug #2600] block.callの中でsuperできない
40206 10/01/28 20:44:59 [shyouhei ruby-l] Re: [Bug #2600] block.callの中でsuperできない
40207 10/01/28 20:55:19 [mame tsg.ne.jp ] Re: [Feature #2366] private constant
40208 10/01/28 21:51:24 [mame tsg.ne.jp ] [Bug:trunk] rubyspec: Date#valid_civil? should be able to handle negative months and days FAILED
40209 10/01/28 22:20:08 [mame tsg.ne.jp ] [Bug:trunk] behavior change of some methods of Date between 1.8 and 1.9
40210 10/01/28 22:33:47 [tadf dotrb.org ] Re: [Bug:trunk] rubyspec: Date#valid_civil? should be able to handle negative months and days FAILED
40211 10/01/28 22:38:22 [fuj rabbix.jp ] Re: [Bug:trunk] Is CGI::HtmlExtension public or not?
40212 10/01/28 22:43:24 [mame tsg.ne.jp ] [Bug:trunk] rubyspec: Date#parse can handle YYDDD as year and day number FAILED
40213 10/01/28 22:44:04 [fuj rabbix.jp ] Re: regression of CGI.parse
40214 10/01/28 22:50:27 [tadf dotrb.org ] Re: [Bug:trunk] behavior change of some methods of Date between 1.8 and 1.9
40215 10/01/28 22:58:48 [redmine ruby-la] [Bug #2675](Rejected) rubyspec: Date#valid_civil? should be able to handle negative months and days FAILED
40216 10/01/28 23:29:39 [tadf dotrb.org ] Re: [Bug:trunk] rubyspec: Date#parse can handle YYDDD as year and day number FAILED
40217 10/01/29 00:15:43 [redmine ruby-la] [Bug #2676](Rejected) behavior change of some methods of Date between 1.8 and 1.9
40218 10/01/29 00:17:03 [redmine ruby-la] [Bug #2677](Rejected) rubyspec: Date#parse can handle YYDDD as year and day number FAILED
40219 10/01/29 00:21:43 [redmine ruby-la] [Bug #2668](Rejected) Is CGI::HtmlExtension public or not?
40220 10/01/29 01:00:03 [tadf dotrb.org ] Re: [Bug #2676](Rejected) behavior change of some methods of Date between 1.8 and 1.9
40221 10/01/29 01:18:07 [mame tsg.ne.jp ] [Bug:trunk] rubyspec: SimpleDelegator when frozen creates a frozen clone ERROR
40222 10/01/29 01:36:27 [matz ruby-lang.] Re: [Bug:trunk] rubyspec: SimpleDelegator when frozen creates a frozen clone ERROR
40223 10/01/29 01:49:15 [matz ruby-lang.] Re: [Bug:trunk] rubyspec: SimpleDelegator when frozen creates a frozen clone ERROR
40224 10/01/29 01:49:26 [matz ruby-lang.] Re: [Bug:trunk] three bugs of Matrix::Scalar
40225 10/01/29 01:50:28 [mame tsg.ne.jp ] [Bug:trunk] some behavior changes of lib/csv.rb between 1.8 and 1.9 -------------------------
40226 10/01/29 01:52:33 [redmine ruby-la] [Bug #2680](Rejected) some behavior changes of lib/csv.rb between 1.8 and 1.9
40227 10/01/29 01:57:06 [redmine ruby-la] [Bug #2679](Closed) rubyspec: SimpleDelegator when frozen creates a frozen clone ERROR
40228 10/01/29 02:37:48 [redmine ruby-la] [Bug #2226] case 文の式が省略され when 節に配列展開があるときの挙動
40229 10/01/29 04:56:48 [keiju ishitsuka] Re: [Bug:trunk] three bugs of Matrix::Scalar
40230 10/01/29 07:36:26 [matz ruby-lang.] Re: [Bug:trunk] three bugs of Matrix::Scalar
40231 10/01/29 08:37:42 [mame tsg.ne.jp ] Re: [Bug:trunk] three bugs of Matrix::Scalar
40232 10/01/29 08:39:56 [mame tsg.ne.jp ] Re: [Bug:trunk] rubyspec: SimpleDelegator when frozen creates a frozen clone ERROR
40233 10/01/29 08:50:32 [akr fsij.org ] utf8-mac: Conditional jump or move depends on uninitialised value(s)
40234 10/01/29 13:03:56 [akr fsij.org ] [bug:trunk] SEGV by autoload after removing load method
40235 10/01/29 13:44:27 [keiju ishitsuka] Re: [Bug:trunk] three bugs of Matrix::Scalar
40236 10/01/29 17:33:29 [mame tsg.ne.jp ] Re: [Bug:trunk] three bugs of Matrix::Scalar
40237 10/01/29 19:24:35 [keiju ishitsuka] Re: [Bug:trunk] three bugs of Matrix::Scalar
40238 10/01/29 19:54:19 [mame tsg.ne.jp ] Re: [Bug:trunk] three bugs of Matrix::Scalar
40239 10/01/29 20:30:13 [m_seki mva.bigl] Re: [Feature #2366] private constant
40240 10/01/29 21:44:29 [mame tsg.ne.jp ] Re: [Bug:trunk] three bugs of Matrix::Scalar
40241 10/01/29 22:32:17 [mame tsg.ne.jp ] [Feature:trunk] rubyspec: Vector.each2 given one argument returns self when given a block FAILED
40242 10/01/29 22:44:14 [redmine ruby-la] [Bug #2679](Open) rubyspec: SimpleDelegator when frozen creates a frozen clone ERROR
40243 10/01/29 23:21:32 [mame tsg.ne.jp ] Re: [Feature #2366] private constant
40244 10/01/30 01:10:11 [mame tsg.ne.jp ] [Bug:trunk] rubyspec: Net::HTTPHeader#content_range returns a Range object that represents the 'Content-Range' header entry FAILED
40245 10/01/30 01:39:15 [redmine ruby-la] [Bug #2600](Assigned) block.callの中でsuperできない
40246 10/01/30 03:57:15 [m_seki mva.bigl] Re: [Feature #2366] private constant
40247 10/01/30 04:47:34 [naruse airemix.] Re: [Feature #2366] private constant
40248 10/01/30 07:08:43 [m_seki mva.bigl] Re: [Feature #2366] private constant
40249 10/01/30 07:20:00 [m_seki mva.bigl] ERB#src (was Re: Re: [Feature #2366] private constant
40250 10/01/30 09:06:02 [m_seki mva.bigl] Re: [Feature #2366] private constant -------------------------
40251 10/01/30 10:26:35 [kou cozmixng.or] Re: [Bug #2600](Assigned) block.callの中でsuperできない
40252 10/01/30 13:52:38 [yugui yugui.jp ] Re: [Bug #2658] rubyspec: Ruby character strings interpolates the return value of Object#inspect, without ivars, if Object#to_s does not return a String instance ERROR
40253 10/01/30 14:02:40 [yugui yugui.jp ] Re: [Bug #2662] BigDecimal#ceil, etc. should not return Integer
40254 10/01/30 14:34:58 [yugui yugui.jp ] Re: [Feature #2366] private constant
40255 10/01/30 19:49:41 [mame tsg.ne.jp ] Re: [Feature #2366] private constant
40256 10/01/30 19:49:41 [mame tsg.ne.jp ] Re: [Feature #2366] private constant
40257 10/01/30 20:02:55 [mame tsg.ne.jp ] Re: ERB#src (was Re: Re: [Feature #2366] private constant
40258 10/01/30 20:12:01 [redmine ruby-la] [Feature #2693] unfriendly exception when command executed for Net::FTP which is not connected
40259 10/01/30 20:12:27 [mame tsg.ne.jp ] Re: [Bug #2662] BigDecimal#ceil, etc. should not return Integer
40260 10/01/30 20:36:47 [mame tsg.ne.jp ] Re: [Bug #2658] rubyspec: Ruby character strings interpolates the return value of Object#inspect, without ivars, if Object#to_s does not return a String instance ERROR
40261 10/01/30 21:13:11 [yugui yugui.jp ] Re: [Bug #2662] BigDecimal#ceil, etc. should not return Integer
40262 10/01/30 21:39:07 [m_seki mva.bigl] Re: ERB#src (was Re: Re: [Feature #2366] private constant
40263 10/01/30 21:54:12 [m_seki mva.bigl] Re: [Feature #2366] private constant
40264 10/01/30 21:57:08 [redmine ruby-la] [Backport #1072](Closed) Ripper#filename
40265 10/01/30 22:09:26 [akr fsij.org ] MonitorMixin::ConditionVariable#wait timeout
40266 10/01/30 22:45:06 [mame tsg.ne.jp ] Re: ERB#src (was Re: Re: [Feature #2366] private constant
40267 10/01/31 00:51:46 [matz ruby-lang.] Re: [Bug:trunk] three bugs of Matrix::Scalar
40268 10/01/31 09:48:36 [nagai ai.kyutec] Array#flatten の仕様変更?
40269 10/01/31 13:27:02 [redmine ruby-la] [Feature #2695] Supported Platforms
40270 10/01/31 18:15:01 [mame tsg.ne.jp ] Re: [Bug:trunk] three bugs of Matrix::Scalar
40271 10/01/31 19:21:45 [mame tsg.ne.jp ] [Bug:trunk] rubyspec: StringIO#ungetc when passed [char] pads with \000 when the current position is after the end ERROR
40272 10/01/31 19:33:23 [mame tsg.ne.jp ] [Bug:trunk] rubyspec: StringIO#ungetc when passed [char] tries to convert the passed length to an Integer using #to_int ERROR
40273 10/01/31 20:22:07 [mame tsg.ne.jp ] [Bug:1.8.7] StringIO#gets with paragraph mode
40274 10/01/31 21:42:46 [mame tsg.ne.jp ] [Bug:trunk] "foo" + :bar should be rejected
40275 10/01/31 21:47:08 [redmine ruby-la] [Bug #2699](Closed) "foo" + :bar should be rejected -------------------------
40276 10/02/01 00:56:34 [yugui yugui.jp ] Re: [Bug:trunk] "foo" + :bar should be rejected
40277 10/02/01 01:26:13 [mame tsg.ne.jp ] Re: [Bug:trunk] "foo" + :bar should be rejected
40278 10/02/01 01:56:49 [mame tsg.ne.jp ] [Bug:trunk] various behavior when reopening File twice
40279 10/02/01 02:10:50 [mame tsg.ne.jp ] [Bug:1.9.1] rubyspec: BigDecimal#div returns NaN if divided by zero and no precision given ERROR
40280 10/02/01 02:19:35 [redmine ruby-la] [Bug #2697](Rejected) rubyspec: StringIO#ungetc when passed [char] tries to convert the passed length to an Integer using #to_int ERROR
40281 10/02/01 08:11:16 [redmine ruby-la] [Bug #2703] make test failed
40282 10/02/01 10:18:53 [redmine ruby-la] [Bug #2700](Assigned) various behavior when reopening File twice
40283 10/02/01 16:03:05 [shyouhei ruby-l] Re: [Bug:1.8.7] StringIO#gets with paragraph mode
40284 10/02/01 16:48:08 [redmine ruby-la] [Bug #2537](Closed) 継承クラスにて、ブロック内にてsuperを呼ぶと、super called outside of method (NoMethodError)が発生する
40285 10/02/01 17:03:05 [matz ruby-lang.] Re: Array#flatten の仕様変更?
40286 10/02/01 18:41:11 [keiju ishitsuka] Re: [Bug:trunk] three bugs of Matrix::Scalar
40287 10/02/01 18:42:45 [keiju ishitsuka] Re: [Feature:trunk] rubyspec: Vector.each2 given one argument returns self when given a block FAILED
40288 10/02/01 18:43:54 [keiju ishitsuka] Re: [Bug:trunk] three bugs of Matrix::Scalar
40289 10/02/01 20:21:56 [redmine ruby-la] [Bug #1954] line number 0?
40290 10/02/01 21:37:05 [redmine ruby-la] [Feature #2687](Closed) rubyspec: Vector.each2 given one argument returns self when given a block FAILED
40291 10/02/01 21:44:06 [mame tsg.ne.jp ] Re: [Feature:trunk] rubyspec: Vector.each2 given one argument returns self when given a block FAILED
40292 10/02/02 08:23:40 [nagai ai.kyutec] Re: Array#flatten の仕様変更?
40293 10/02/02 13:33:14 [redmine ruby-la] [Bug #2704] CGI::rfc1123_date causes NameError
40294 10/02/02 17:21:24 [matz ruby-lang.] Re: Array#flatten の仕様変更?
40295 10/02/02 18:22:54 [nobu ruby-lang.] Re: [Bug:trunk] rubyspec: Net::HTTPHeader#content_range returns a Range object that represents the 'Content-Range' header entry FAILED
40296 10/02/03 08:03:30 [ksmakoto dd.iij] nkf MINE encoding bug
40297 10/02/03 10:51:32 [redmine ruby-la] [Bug #1977](Closed) test failed in test_isdigit in test/dl/test_func.rb on sparc-solaris-2.10 (64bit)
40298 10/02/03 13:53:36 [naruse airemix.] Re: [ruby-cvs:33760] Ruby:r26545 (trunk): Wed Feb 3 10:12:09 2010 Aaron Patterson <tenderlove@ruby-lang.org>
40299 10/02/03 13:54:19 [ngoto gen-info.] Re: [Bug #1977](Closed) test failed in test_isdigit in test/dl/test_func.rb on sparc-solaris-2.10 (64bit)
40300 10/02/03 14:32:22 [naruse airemix.] Re: [ruby-cvs:33760] Ruby:r26545 (trunk): Wed Feb 3 10:12:09 2010 Aaron Patterson <tenderlove@ruby-lang.org> -------------------------
40301 10/02/03 14:37:15 [shyouhei ruby-l] Re: [Bug #2600](Assigned) block.callの中でsuperできない
40302 10/02/03 14:52:33 [aaron.patterson] Re: [ruby-cvs:33760] Ruby:r26545 (trunk): Wed Feb 3 10:12:09 2010 Aaron Patterson <tenderlove@ruby-lang.org>
40303 10/02/03 15:46:48 [naruse airemix.] Re: [ruby-cvs:33760] Ruby:r26545 (trunk): Wed Feb 3 10:12:09 2010 Aaron Patterson <tenderlove@ruby-lang.org>
40304 10/02/03 16:10:13 [naruse airemix.] Re: [Bug #1977](Closed) test failed in test_isdigit in test/dl/test_func.rb on sparc-solaris-2.10 (64bit)
40305 10/02/03 18:04:24 [mame tsg.ne.jp ] What purpose is Net::FTP#last_response for?
40306 10/02/03 20:40:05 [usa garbagecoll] Re: [ruby-cvs:33760] Ruby:r26545 (trunk): Wed Feb 3 10:12:09 2010 Aaron Patterson <tenderlove@ruby-lang.org>
40307 10/02/03 21:07:13 [kosaki.motohiro] Re: [ruby-cvs:33760] Ruby:r26545 (trunk): Wed Feb 3 10:12:09 2010 Aaron Patterson <tenderlove@ruby-lang.org>
40308 10/02/03 21:11:20 [mame tsg.ne.jp ] Re: ERB#src (was Re: Re: [Feature #2366] private constant
40309 10/02/03 21:19:16 [kosaki.motohiro] Why can't we use get_stack()
40310 10/02/03 22:35:54 [kosaki.motohiro] Re: Why can't we use get_stack()
40311 10/02/03 22:59:06 [kou cozmixng.or] Re: [Bug #2600](Assigned) block.callの中でsuperできない
40312 10/02/04 08:17:45 [redmine ruby-la] [Bug #2679](Closed) rubyspec: SimpleDelegator when frozen creates a frozen clone ERROR
40313 10/02/04 10:36:06 [matz ruby-lang.] Re: [Bug #2679](Closed) rubyspec: SimpleDelegator when frozen creates a frozen clone ERROR
40314 10/02/04 12:43:19 [redmine ruby-la] [Bug #2679](Open) rubyspec: SimpleDelegator when frozen creates a frozen clone ERROR
40315 10/02/04 12:50:57 [redmine ruby-la] [Backport #2463](Closed) String#center
40316 10/02/04 23:08:06 [muraken gmail.c] Re: メンテナ確認プロセス終了。メンテナ募集
40317 10/02/05 00:18:25 [mame tsg.ne.jp ] [Bug:trunk] TCPServer#gets gets stuck
40318 10/02/05 00:37:05 [redmine ruby-la] [Bug #2661](Closed) Bignum <= BigDecimal("NaN") raises an Exception
40319 10/02/05 01:07:13 [mame tsg.ne.jp ] Re: メンテナ確認プロセス終了。メンテナ募集
40320 10/02/05 03:45:49 [mame tsg.ne.jp ] Re: [Bug:trunk] rubyspec: StringIO#ungetc when passed [char] pads with \000 when the current position is after the end ERROR
40321 10/02/05 06:41:02 [redmine ruby-la] [Bug #2575] a test fail for IO#readpartial is broken on *BSD
40322 10/02/05 10:50:24 [akr fsij.org ] Re: [Bug:trunk] TCPServer#gets gets stuck
40323 10/02/05 12:21:07 [mame tsg.ne.jp ] Re: [Bug:trunk] TCPServer#gets gets stuck
40324 10/02/05 14:00:56 [shugo ruby-lang] Re: What purpose is Net::FTP#last_response for?
40325 10/02/05 14:05:05 [akr fsij.org ] Re: [Bug:trunk] TCPServer#gets gets stuck -------------------------
40326 10/02/05 14:48:27 [shugo ruby-lang] Re: MonitorMixin::ConditionVariable#wait timeout
40327 10/02/05 16:39:42 [nobu ruby-lang.] Re: [Bug #2679](Open) rubyspec: SimpleDelegator when frozen creates a frozen clone ERROR
40328 10/02/05 17:21:58 [redmine ruby-la] [Bug #2575] a test fail for IO#readpartial is broken on *BSD
40329 10/02/05 22:56:15 [mame tsg.ne.jp ] Re: [Bug:trunk] TCPServer#gets gets stuck
40330 10/02/05 23:05:03 [mame tsg.ne.jp ] Re: [Bug #2679](Open) rubyspec: SimpleDelegator when frozen creates a frozen clone ERROR
40331 10/02/05 23:40:10 [mame tsg.ne.jp ] Re: [Bug #2679](Open) rubyspec: SimpleDelegator when frozen creates a frozen clone ERROR
40332 10/02/06 00:54:33 [matz ruby-lang.] Re: [Bug #2679](Open) rubyspec: SimpleDelegator when frozen creates a frozen clone ERROR
40333 10/02/06 02:08:42 [redmine ruby-la] [Bug #2696](Closed) rubyspec: StringIO#ungetc when passed [char] pads with \000 when the current position is after the end ERROR
40334 10/02/06 11:55:38 [redmine ruby-la] [Bug #2716] make main is stopped by error in compile_prelude.rb
40335 10/02/06 11:58:56 [redmine ruby-la] [Bug #2716] make main is stopped by error in compile_prelude.rb
40336 10/02/06 21:15:06 [redmine ruby-la] [Bug #2716] make main is stopped by error in compile_prelude.rb
40337 10/02/07 00:27:41 [redmine ruby-la] [Feature #2693](Closed) unfriendly exception when command executed for Net::FTP which is not connected
40338 10/02/07 00:50:15 [naruse airemix.] Re: nkf MINE encoding bug
40339 10/02/07 14:18:52 [akr fsij.org ] Re: [ruby-cvs:33760] Ruby:r26545 (trunk): Wed Feb 3 10:12:09 2010 Aaron Patterson <tenderlove@ruby-lang.org>
40340 10/02/07 16:06:28 [mame tsg.ne.jp ] Re: patch for ruby-core:17472
40341 10/02/07 18:06:35 [muraken gmail.c] Re: patch for ruby-core:17472
40342 10/02/07 18:26:17 [naruse airemix.] Re: メンテナ確認プロセス終了。メンテナ募集
40343 10/02/07 19:16:30 [mame tsg.ne.jp ] Re: patch for ruby-core:17472
40344 10/02/07 20:40:16 [muraken gmail.c] Re: メンテナ確認プロセス終了。メンテナ募集
40345 10/02/07 21:37:41 [naruse airemix.] Re: [ruby-cvs:33760] Ruby:r26545 (trunk): Wed Feb 3 10:12:09 2010 Aaron Patterson <tenderlove@ruby-lang.org>
40346 10/02/07 22:04:29 [nobu_toyofuku n] Re: patch for ruby-core:17472
40347 10/02/08 07:32:57 [muraken gmail.c] Re: patch for ruby-core:17472
40348 10/02/08 08:51:36 [s.wanabe gmail.] Re: patch for ruby-core:17472
40349 10/02/08 19:36:21 [nobu_toyofuku n] Re: patch for ruby-core:17472
40350 10/02/08 23:51:35 [muraken gmail.c] Re: patch for ruby-core:17472 -------------------------
40351 10/02/08 23:55:28 [mame tsg.ne.jp ] Re: patch for ruby-core:17472
40352 10/02/09 01:14:08 [muraken gmail.c] Re: patch for ruby-core:17472
40353 10/02/09 01:31:14 [muraken gmail.c] Re: patch for ruby-core:17472
40354 10/02/09 03:04:37 [redmine ruby-la] [Bug #2724] fork from other than the main thread causes wrong pthread condition on NetBSD
40355 10/02/09 12:34:34 [shigeo tinyfore] Re: メンテナ確認プロセス終了。メンテナ募集
40356 10/02/09 13:44:05 [akr fsij.org ] Re: [ruby-cvs:33760] Ruby:r26545 (trunk): Wed Feb 3 10:12:09 2010 Aaron Patterson <tenderlove@ruby-lang.org>
40357 10/02/09 14:19:48 [kosaki.motohiro] Re: [ruby-cvs:33760] Ruby:r26545 (trunk): Wed Feb 3 10:12:09 2010 Aaron Patterson <tenderlove@ruby-lang.org>
40358 10/02/09 15:07:48 [shigeo tinyfore] Re: メンテナ確認プロセス終了。メンテナ募集
40359 10/02/09 15:42:14 [tetsuya.watanab] trunk \w match
40360 10/02/09 16:44:01 [matz ruby-lang.] Re: trunk \w match
40361 10/02/09 17:16:23 [tetsuya.watanab] Re: trunk \w match
40362 10/02/09 17:53:27 [naruse airemix.] Re: trunk \w match
40363 10/02/09 18:15:11 [akr fsij.org ] Re: [ruby-cvs:33760] Ruby:r26545 (trunk): Wed Feb 3 10:12:09 2010 Aaron Patterson <tenderlove@ruby-lang.org>
40364 10/02/09 18:33:25 [tetsuya.watanab] Re: trunk \w match
40365 10/02/09 18:45:33 [kosaki.motohiro] Re: [ruby-cvs:33760] Ruby:r26545 (trunk): Wed Feb 3 10:12:09 2010 Aaron Patterson <tenderlove@ruby-lang.org>
40366 10/02/09 20:10:25 [naruse airemix.] Re: trunk \w match
40367 10/02/09 21:06:36 [akr fsij.org ] Re: [ruby-cvs:33760] Ruby:r26545 (trunk): Wed Feb 3 10:12:09 2010 Aaron Patterson <tenderlove@ruby-lang.org>
40368 10/02/09 21:42:30 [mame tsg.ne.jp ] Re: [Bug #2658] rubyspec: Ruby character strings interpolates the return value of Object#inspect, without ivars, if Object#to_s does not return a String instance ERROR
40369 10/02/09 21:55:17 [nobu_toyofuku n] Re: patch for ruby-core:17472
40370 10/02/09 21:55:16 [mame tsg.ne.jp ] Re: ERB#src (was Re: Re: [Feature #2366] private constant
40371 10/02/09 22:23:04 [mame tsg.ne.jp ] Re: [Bug:trunk] TCPServer#gets gets stuck
40372 10/02/09 22:34:34 [akr fsij.org ] Re: [Bug:trunk] TCPServer#gets gets stuck
40373 10/02/09 22:37:20 [redmine ruby-la] [Bug #2712](Closed) TCPServer#gets gets stuck
40374 10/02/09 22:57:15 [tetsuya.watanab] Re: trunk \w match
40375 10/02/09 23:09:30 [mame tsg.ne.jp ] Re: メンテナ確認プロセス終了。メンテナ募集 -------------------------
40376 10/02/09 23:27:33 [mame tsg.ne.jp ] Re: patch for ruby-core:17472
40377 10/02/09 23:59:10 [redmine ruby-la] [Bug #2727] make: *** [encdb.h] Aborted
40378 10/02/10 18:22:34 [m_seki mva.bigl] Re: ERB#src (was Re: Re: [Feature #2366] private constant
40379 10/02/10 23:20:11 [mame tsg.ne.jp ] rubyspec: File.new raises an Errno::EINVAL error with File::APPEND FAILED
40380 10/02/10 23:54:20 [kinpoco gmail.c] Re: [ruby-cvs:33760] Ruby:r26545 (trunk): Wed Feb 3 10:12:09 2010 Aaron Patterson <tenderlove@ruby-lang.org>
40381 10/02/11 00:16:00 [naruse airemix.] Re: [ruby-cvs:33760] Ruby:r26545 (trunk): Wed Feb 3 10:12:09 2010 Aaron Patterson <tenderlove@ruby-lang.org>
40382 10/02/11 00:29:17 [mame tsg.ne.jp ] [Bug:trunk] rubyspec: ObjectSpace.define_finalizer doesn't call self-referencing finalizers FAILED
40383 10/02/11 00:43:28 [kinpoco gmail.c] Re: [ruby-cvs:33760] Ruby:r26545 (trunk): Wed Feb 3 10:12:09 2010 Aaron Patterson <tenderlove@ruby-lang.org>
40384 10/02/11 02:58:28 [mame tsg.ne.jp ] [Bug:trunk] rubyspec: Time#+ rounds micro seconds rather than truncates FAILED
40385 10/02/11 03:03:12 [mame tsg.ne.jp ] Re: ERB#src (was Re: Re: [Feature #2366] private constant
40386 10/02/11 12:28:22 [akr fsij.org ] [bug:trunk] regexp marshal problem from 1.9.1 to 1.9.2
40387 10/02/11 15:24:25 [redmine ruby-la] [Bug #2516] IO#reopen Compatibility (original: )
40388 10/02/11 16:01:19 [akr fsij.org ] [bug:trunk] marshal changes ["foo", "bar", "bar"] to ["foo", "bar", "EUC-JP"]
40389 10/02/11 16:46:32 [akr fsij.org ] Re: [Bug:trunk] TCPServer#gets gets stuck
40390 10/02/11 17:14:31 [mame tsg.ne.jp ] Re: [Bug:trunk] TCPServer#gets gets stuck
40391 10/02/11 17:34:04 [mame tsg.ne.jp ] Re: [Bug:trunk] TCPServer#gets gets stuck
40392 10/02/11 17:35:00 [akr fsij.org ] Re: [Bug:trunk] TCPServer#gets gets stuck
40393 10/02/11 18:36:14 [mame tsg.ne.jp ] Re: [Bug:trunk] TCPServer#gets gets stuck
40394 10/02/11 19:08:05 [mame tsg.ne.jp ] Re: [Bug:trunk] rubyspec: ObjectSpace.define_finalizer doesn't call self-referencing finalizers FAILED
40395 10/02/11 19:18:54 [redmine ruby-la] [Bug #2735] miniruby make failed on powerpc-darwin9.8.0
40396 10/02/11 19:27:54 [redmine ruby-la] [Bug #2735](Closed) miniruby make failed on powerpc-darwin9.8.0
40397 10/02/11 19:33:05 [akr fsij.org ] Re: rubyspec: File.new raises an Errno::EINVAL error with File::APPEND FAILED
40398 10/02/11 20:43:57 [kosaki.motohiro] Re: [Bug:trunk] TCPServer#gets gets stuck
40399 10/02/11 21:30:52 [mame tsg.ne.jp ] Re: rubyspec: File.new raises an Errno::EINVAL error with File::APPEND FAILED
40400 10/02/11 21:36:54 [akr fsij.org ] Re: [Bug:trunk] rubyspec: Time#+ rounds micro seconds rather than truncates FAILED -------------------------