ruby_core (41401-41600)

 < ^ > 
41401 11/11/30 09:22:03 [aaron tenderlov] [Backport93 - Backport #5646][Closed] Backport r33775
41402 11/11/30 09:25:09 [naruse airemix.] [ruby-trunk - Feature #5666] Make rb_path2class public
41403 11/11/30 11:41:57 [wycats gmail.co] Re: [Backport93 - Backport #5621] Please backport thread-safe autoloading patch
41404 11/11/30 12:10:02 [wycats gmail.co] [ruby-trunk - Bug #5690][Open] Module#qualified_const_get
41405 11/11/30 12:13:42 [naruse airemix.] [ruby-trunk - Bug #5690][Assigned] Module#qualified_const_get
41406 11/11/30 15:04:58 [matz ruby-lang.] Re: [ruby-trunk - Bug #5690][Open] Module#qualified_const_get
41407 11/11/30 16:41:04 [neleai seznam.c] Re: [ruby-trunk - Feature #5663] Combined map/select method
41408 11/11/30 16:52:36 [wycats gmail.co] Re: [ruby-trunk - Bug #5690][Open] Module#qualified_const_get
41409 11/11/30 18:17:26 [matz ruby-lang.] Re: [ruby-trunk - Bug #5690][Open] Module#qualified_const_get
41410 11/11/30 22:21:41 [naruse airemix.] [ruby-trunk - Bug #5691][Open] rb_path2class raises a NameError if a constant in the path exists on toplevel
41411 11/11/30 23:24:39 [h.shirosaki gma] [ruby-trunk - Feature #5562] Improvement of Windows IO performance
41412 11/11/30 23:31:36 [h.shirosaki gma] [ruby-trunk - Feature #5562] Improvement of Windows IO performance
41413 11/12/01 01:48:30 [redmine ruby-la] [ruby-trunk - Feature #5692][Open] IMAP -- error for msg_att will report the UID
41414 11/12/01 02:19:31 [kosaki.motohiro] Re: [Backport93 - Backport #5646][Closed] Backport r33775
41415 11/12/01 05:28:01 [rr.rosas gmail.] Re: [ruby-trunk - Feature #5663] Combined map/select method
41416 11/12/01 05:59:21 [wycats gmail.co] Re: [ruby-trunk - Bug #5690][Open] Module#qualified_const_get
41417 11/12/01 07:07:38 [redmine ruby-la] [ruby-trunk - Feature #5692][Assigned] IMAP -- error for msg_att will report the UID
41418 11/12/01 08:34:48 [drbrain segment] clang warning in bigdecimal
41419 11/12/01 10:04:00 [tenderlove ruby] Re: [ruby-trunk - Bug #5690][Open] Module#qualified_const_get
41420 11/12/01 10:09:46 [tenderlove ruby] Re: [Backport93 - Backport #5646][Closed] Backport r33775
41421 11/12/01 10:16:51 [stephen touset.] [ruby-trunk - Feature #5653] "I strongly discourage the use of autoload in any standard libraries" (Re: autoload will be dead)
41422 11/12/01 10:27:58 [kosaki.motohiro] Re: [Backport93 - Backport #5646][Closed] Backport r33775
41423 11/12/01 10:34:26 [stephen touset.] [ruby-trunk - Feature #5653] "I strongly discourage the use of autoload in any standard libraries" (Re: autoload will be dead)
41424 11/12/01 10:35:24 [luislavena gmai] Re: [Backport93 - Backport #5646][Closed] Backport r33775
41425 11/12/01 10:36:55 [wycats gmail.co] [ruby-trunk - Feature #2740] Extend const_missing to pass in the nesting -------------------------
41426 11/12/01 10:36:55 [wycats gmail.co] [ruby-trunk - Feature #5653] "I strongly discourage the use of autoload in any standard libraries" (Re: autoload will be dead)
41427 11/12/01 11:02:32 [naruse airemix.] [ruby-trunk - Bug #5693][Assigned] clang warning in bigdecimal
41428 11/12/01 11:21:11 [drbrain segment] Re: [Backport93 - Backport #5646][Closed] Backport r33775
41429 11/12/01 17:54:19 [muranov math.un] [ruby-trunk - Feature #5478] import Set into core, add syntax
41430 11/12/01 19:02:06 [michel demazure] Re: [ruby-trunk - Feature #5478] import Set into core, add syntax
41431 11/12/01 20:16:06 [ruby-core marc-] [ruby-trunk - Bug #5694][Open] Proc#arity doesn't take optional arguments into account.
41432 11/12/01 23:14:51 [stephen touset.] [ruby-trunk - Feature #5653] "I strongly discourage the use of autoload in any standard libraries" (Re: autoload will be dead)
41433 11/12/01 23:50:14 [naruse airemix.] [ruby-trunk - Bug #5684] [[Ruby 1.9:]] Socket doesn't respect default external encoding
41434 11/12/01 23:55:52 [nagachika00 gma] [ruby-trunk - Bug #5539] Readline.readline() blocks all threads
41435 11/12/02 03:52:36 [sunaku gmail.co] [ruby-trunk - Feature #5695][Open] CoffeeScript "is" and "isnt" keywords
41436 11/12/02 07:07:00 [drbrain segment] [ruby-trunk - Feature #5695] CoffeeScript "is" and "isnt" keywords
41437 11/12/02 07:35:55 [headius headius] [ruby-trunk - Bug #5696][Open] rexml BaseParser uses instance_eval unnecessarily on listener add
41438 11/12/02 07:42:34 [drbrain segment] [ruby-trunk - Bug #5697][Open] Wrong flag for enabling PIE executables with clang
41439 11/12/02 07:53:02 [wycats gmail.co] Re: [ruby-trunk - Feature #5695] CoffeeScript "is" and "isnt" keywords
41440 11/12/02 08:38:09 [headius headius] [Ruby 1.8 - Bug #5698][Open] rexml Encoding logic creates unnecessary singleton classes, aliases at runtime
41441 11/12/02 08:39:59 [headius headius] [Ruby 1.8 - Bug #5698] rexml Encoding logic creates unnecessary singleton classes, aliases at runtime
41442 11/12/02 08:49:57 [transfire gmail] [ruby-trunk - Bug #5694] Proc#arity doesn't take optional arguments into account.
41443 11/12/02 08:54:35 [wycats gmail.co] Re: [ruby-trunk - Bug #5694] Proc#arity doesn't take optional arguments into account.
41444 11/12/02 10:05:24 [nobu ruby-lang.] [ruby-trunk - Bug #5459] Silence -Wmissing-declarations and -Wold-style-definition warnings in mkmf
41445 11/12/02 10:17:05 [iamvlad gmail.c] [ruby-trunk - Bug #5684] [[Ruby 1.9:]] Socket doesn't respect default external encoding
41446 11/12/02 10:25:39 [jballanc gmail.] Re: [ruby-trunk - Bug #5694] Proc#arity doesn't take optional arguments into account.
41447 11/12/02 10:36:07 [iamvlad gmail.c] [ruby-trunk - Bug #5684] [[Ruby 1.9:]] Socket doesn't respect default external encoding
41448 11/12/02 12:45:50 [kosaki.motohiro] [ruby-trunk - Bug #5697][Closed] Wrong flag for enabling PIE executables with clang
41449 11/12/02 13:13:22 [kosaki.motohiro] [ruby-trunk - Bug #5697][Open] Wrong flag for enabling PIE executables with clang
41450 11/12/02 13:13:26 [wycats gmail.co] Re: [ruby-trunk - Bug #5694] Proc#arity doesn't take optional arguments into account. -------------------------
41451 11/12/02 15:22:58 [naruse airemix.] [ruby-trunk - Bug #5684] [[Ruby 1.9:]] Socket doesn't respect default external encoding
41452 11/12/02 17:33:20 [transfire gmail] Re: [ruby-trunk - Bug #5694] Proc#arity doesn't take optional arguments into account.
41453 11/12/02 17:59:07 [now bitwi.se ] Re: [ruby-trunk - Bug #5459] Silence -Wmissing-declarations and -Wold-style-definition warnings in mkmf
41454 11/12/03 04:20:57 [wycats gmail.co] Re: [ruby-trunk - Bug #5694] Proc#arity doesn't take optional arguments into account.
41455 11/12/03 06:22:45 [sunaku gmail.co] [ruby-trunk - Feature #5588] add negation flag (v) to Regexp
41456 11/12/03 10:37:14 [normalperson yh] [ruby-trunk - Bug #5700][Open] fork {} segfaults during VM cleanup when run inside Fiber
41457 11/12/03 11:03:10 [luislavena gmai] [ruby-trunk - Feature #5562] Improvement of Windows IO performance
41458 11/12/03 17:20:09 [7t3rf0x dispost] [ruby-trunk - Bug #5701][Open] Compilation under Lion with clang 2.1 fails
41459 11/12/03 22:13:19 [viniciusgati gm] [ruby-trunk - Bug #5659] bug releasing a gem created with rails 3.1
41460 11/12/03 22:39:26 [viniciusgati gm] [ruby-trunk - Bug #5659] bug releasing a gem created with rails 3.1
41461 11/12/04 03:10:43 [headius headius] [ruby-trunk - Feature #5478] import Set into core, add syntax
41462 11/12/04 03:15:28 [kosaki.motohiro] [ruby-trunk - Bug #5701] Compilation under Lion with clang 2.1 fails
41463 11/12/04 05:54:23 [bryan brynary.c] [ruby-trunk - Bug #5703][Open] Ruby 1.9.3p0 segmentation fault (during autoload?)
41464 11/12/04 06:53:31 [jos catnook.com] [ruby-trunk - Feature #5478] import Set into core, add syntax
41465 11/12/04 06:57:09 [nobu ruby-lang.] [ruby-trunk - Bug #5701][Feedback] Compilation under Lion with clang 2.1 fails
41466 11/12/04 08:42:43 [jballanc gmail.] Re: [ruby-trunk - Feature #5478] import Set into core, add syntax
41467 11/12/04 10:28:13 [muranov math.un] [ruby-trunk - Feature #5478] import Set into core, add syntax
41468 11/12/04 10:35:36 [luislavena gmai] [Backport93 - Backport #5704][Open] Please backport r33937
41469 11/12/04 11:34:24 [luislavena gmai] [ruby-trunk - Bug #5681][Closed] Conflcting types for rb_w32_inet_ntop caused by duplicate definition under MinGW
41470 11/12/04 12:34:00 [naruse airemix.] Re: [ruby-trunk - Bug #5690][Open] Module#qualified_const_get
41471 11/12/04 12:41:16 [naruse airemix.] Re: [ruby-trunk - Bug #5694] Proc#arity doesn't take optional arguments into account.
41472 11/12/04 15:39:40 [wycats gmail.co] Re: [ruby-trunk - Bug #5694] Proc#arity doesn't take optional arguments into account.
41473 11/12/04 21:32:02 [muranov math.un] [ruby-trunk - Feature #5478] import Set into core, add syntax
41474 11/12/04 23:07:09 [transfire gmail] [ruby-trunk - Feature #5478] import Set into core, add syntax
41475 11/12/04 23:14:29 [phasis gmail.co] [ruby-trunk - Bug #5706][Open] Build failure on io/wait extension with VC 2010 -------------------------
41476 11/12/04 23:15:00 [muranov math.un] [ruby-trunk - Feature #5478] import Set into core, add syntax
41477 11/12/04 23:14:59 [transfire gmail] Re: [ruby-trunk - Bug #5694] Proc#arity doesn't take optional arguments into account.
41478 11/12/04 23:31:59 [akr fsij.org ] [ruby-trunk - Feature #5707][Open] temporary file creation without finalizer and delegate.
41479 11/12/05 02:26:44 [sylvain.daubert] [ruby-trunk - Bug #5709][Open] Improve Regexp documentation
41480 11/12/05 03:05:14 [ruby-ml kittens] Re: [ruby-trunk - Feature #5478] import Set into core, add syntax
41481 11/12/05 03:42:10 [normalperson yh] Re: [ruby-trunk - Feature #5707][Open] temporary file creation without finalizer and delegate.
41482 11/12/05 05:02:29 [naruse airemix.] Re: [ruby-trunk - Bug #5694][Open] Proc#arity doesn't take optional arguments into account.
41483 11/12/05 07:34:03 [jballanc gmail.] Re: [ruby-trunk - Feature #5478] import Set into core, add syntax
41484 11/12/05 09:18:21 [akr fsij.org ] Re: [ruby-trunk - Feature #5707][Open] temporary file creation without finalizer and delegate.
41485 11/12/05 10:23:03 [adam aprescott.] Re: [ruby-trunk - Feature #5478] import Set into core, add syntax
41486 11/12/05 11:31:07 [matias eudemocr] [ruby-trunk - Feature #5710][Open] Enumerable#each( :method ) and Enumerable#map( :method )
41487 11/12/05 12:16:31 [transfire gmail] [ruby-trunk - Feature #5710] Enumerable#each( :method ) and Enumerable#map( :method )
41488 11/12/05 12:56:41 [usa garbagecoll] [ruby-trunk - Bug #5706][Assigned] Build failure on io/wait extension with VC 2010
41489 11/12/05 15:27:35 [kosaki.motohiro] Re: [ruby-trunk - Feature #5707][Open] temporary file creation without finalizer and delegate.
41490 11/12/05 19:59:11 [muranov math.un] [ruby-trunk - Feature #5478] import Set into core, add syntax
41491 11/12/05 20:11:50 [alex blackkettl] Re: [ruby-trunk - Feature #5695][Open] CoffeeScript "is" and "isnt" keywords
41492 11/12/06 06:28:03 [rogerdpack2 gma] Re: [ruby-trunk - Feature #5654] Introduce global lock to avoid concurrent require
41493 11/12/06 12:31:00 [drbrain segment] [ruby-trunk - Bug #5656] Improve documentation for Range
41494 11/12/06 12:36:58 [john.firebaugh ] [ruby-trunk - Bug #5713][Open] Fixnum#** returns Infinity for 0 ** negative Bignum
41495 11/12/06 12:51:54 [shugo ruby-lang] Re: [ANN] 2011 Call for grant proposals
41496 11/12/06 12:52:50 [phasis gmail.co] [ruby-trunk - Bug #5714][Open] Unexpected error of STDIN#read with non-ascii input on Windows XP
41497 11/12/06 12:56:03 [shugo ruby-lang] Re: [ANN] 2011 Call for grant proposals
41498 11/12/06 13:26:26 [john.firebaugh ] [ruby-trunk - Bug #5715][Open] +/-1 ** Bignum returns different results than +/-1 ** Fixnum
41499 11/12/06 14:57:45 [headius headius] Re: [ANN] 2011 Call for grant proposals
41500 11/12/06 15:57:36 [phasis gmail.co] [ruby-trunk - Bug #5714] Unexpected error of STDIN#read with non-ascii input on Windows XP -------------------------
41501 11/12/06 16:18:18 [usa garbagecoll] Re: [ruby-trunk - Bug #5714] Unexpected error of STDIN#read with non-ascii input on Windows XP
41502 11/12/06 19:07:30 [shevegen gmail.] [ruby-trunk - Feature #5716][Open] duplicated when clause is ignored -> Report which clause it is specifically.
41503 11/12/06 22:34:10 [luislavena gmai] Re: [ruby-trunk - Bug #5714] Unexpected error of STDIN#read with non-ascii input on Windows XP
41504 11/12/06 23:28:56 [rogerdpack2 gma] Re: [ANN] 2011 Call for grant proposals
41505 11/12/07 00:42:47 [transfire gmail] Re: [ruby-trunk - Bug #5694][Open] Proc#arity doesn't take optional arguments into account.
41506 11/12/07 00:48:16 [transfire gmail] Re: [ruby-trunk - Feature #5695][Open] CoffeeScript "is" and "isnt" keywords
41507 11/12/07 02:19:51 [redmine ruby-la] [Backport93 - Backport #5704] Please backport r33937
41508 11/12/07 07:27:03 [aaron tenderlov] [Backport93 - Backport #5537] Please backport Psych 1.2.2 update
41509 11/12/07 08:45:02 [drbrain segment] [Backport93 - Backport #5537] Please backport Psych 1.2.2 update
41510 11/12/07 10:01:33 [shyouhei ruby-l] Re: [ruby-trunk - Bug #5694][Open] Proc#arity doesn't take optional arguments into account.
41511 11/12/07 11:30:44 [nick quaran.to ] [ruby-trunk - Bug #5719][Open] Hash::[] can't handle 100000+ args
41512 11/12/07 11:47:50 [glassj67 gmail.] [ruby-trunk - Bug #5719] Hash::[] can't handle 100000+ args
41513 11/12/07 12:00:53 [matz ruby-lang.] Re: [ruby-trunk - Bug #5719][Open] Hash::[] can't handle 100000+ args
41514 11/12/07 12:03:59 [nobu ruby-lang.] Re: [ruby-trunk - Bug #5714] Unexpected error of STDIN#read with non-ascii input on Windows XP
41515 11/12/07 12:05:06 [gabriel.gironda] [ruby-trunk - Bug #5719] Hash::[] can't handle 100000+ args
41516 11/12/07 12:27:57 [deepfryed gmail] [ruby-trunk - Bug #5719] Hash::[] can't handle 100000+ args
41517 11/12/07 12:50:07 [evan phx.io ] Re: [ruby-trunk - Bug #5719][Open] Hash::[] can't handle 100000+ args
41518 11/12/07 12:50:09 [evan phx.io ] Re: [ruby-trunk - Bug #5719][Open] Hash::[] can't handle 100000+ args
41519 11/12/07 14:26:58 [duerst it.aoyam] [ruby-trunk - Bug #5719] Hash::[] can't handle 100000+ args
41520 11/12/07 15:51:35 [gabriel.gironda] [ruby-trunk - Bug #5720][Open] Exceptions can be caused via eval that evade exception handling
41521 11/12/07 18:01:56 [muranov math.un] [ruby-trunk - Feature #5478] import Set into core, add syntax
41522 11/12/07 21:59:35 [redmine ruby-la] [ruby-trunk - Bug #5721][Open] require_relative
41523 11/12/07 22:36:37 [h.shirosaki gma] Re: [ruby-trunk - Bug #5714] Unexpected error of STDIN#read with non-ascii input on Windows XP
41524 11/12/08 01:48:44 [rdmoore appistr] [ruby-trunk - Bug #5723][Open] Ruby fails when standard input is closed
41525 11/12/08 01:56:51 [matias eudemocr] [ruby-trunk - Feature #5710] Enumerable#each( :method ) and Enumerable#map( :method ) -------------------------
41526 11/12/08 02:26:20 [yutaka.hara gma] Re: [ANN] 2011 Call for grant proposals
41527 11/12/08 02:26:23 [kosaki.motohiro] [ruby-trunk - Bug #5723] Ruby fails when standard input is closed
41528 11/12/08 05:56:17 [drbrain segment] [ruby-trunk - Feature #5623][Feedback] [PATCH] Update documentation for Complex
41529 11/12/08 07:15:14 [luislavena gmai] [ruby-trunk - Bug #5724][Open] date_core compiling issues with MinGW GCC 4.6
41530 11/12/08 07:59:40 [kosaki.motohiro] [ruby-trunk - Bug #5679][Assigned] Too many arguments for format warnings on mingw32 build
41531 11/12/08 08:24:46 [drbrain segment] [ruby-trunk - Bug #5709] Improve Regexp documentation
41532 11/12/08 09:30:19 [akr fsij.org ] Re: [ruby-trunk - Bug #5721][Open] require_relative
41533 11/12/08 09:34:20 [akr fsij.org ] [ruby-trunk - Bug #5721][Feedback] require_relative
41534 11/12/08 09:39:33 [nobu ruby-lang.] [ruby-trunk - Bug #5721] require_relative
41535 11/12/08 10:01:09 [duerst it.aoyam] [ruby-trunk - Feature #5710][Closed] Enumerable#each( :method ) and Enumerable#map( :method )
41536 11/12/08 10:22:10 [phasis gmail.co] Re: [ruby-trunk - Bug #5714] Unexpected error of STDIN#read with non-ascii input on Windows XP
41537 11/12/08 10:25:35 [steve rtsw.co.u] [ruby-trunk - Feature #2294] [PATCH] ruby_bind_stack() to embed Ruby in coroutine
41538 11/12/08 10:49:19 [rogerdpack2 gma] Re: [ANN] 2011 Call for grant proposals
41539 11/12/08 13:36:34 [meta pobox.com ] [ruby-trunk - Bug #5487] popen3 + timeout regression in ruby 1.9
41540 11/12/08 13:37:25 [meta pobox.com ] [ruby-trunk - Bug #4681] Timeout.timeout doesn't actually time out?
41541 11/12/08 14:15:44 [akr fsij.org ] [ruby-trunk - Feature #5726][Open] Process::EXIT_SUCCESS and Process::EXIT_FAILURE
41542 11/12/08 14:54:09 [h.shirosaki gma] [ruby-trunk - Bug #5714] Unexpected error of STDIN#read with non-ascii input on Windows XP
41543 11/12/08 15:00:31 [nobu ruby-lang.] [ruby-trunk - Feature #5726][Feedback] Process::EXIT_SUCCESS and Process::EXIT_FAILURE
41544 11/12/08 15:27:24 [andyjpn gmail.c] [ruby-trunk - Bug #5614] Proc#source_location & #inspect shows wrong line number when chained
41545 11/12/08 16:15:30 [funny.falcon gm] [ruby-trunk - Bug #5727][Open] Hidden bug in load.c rb_feature_p
41546 11/12/08 16:24:11 [funny.falcon gm] [ruby-trunk - Feature #5427] Not complex patch to improve `require` time (load.c)
41547 11/12/08 17:22:23 [akr fsij.org ] Re: [ruby-trunk - Feature #5726][Feedback] Process::EXIT_SUCCESS and Process::EXIT_FAILURE
41548 11/12/08 21:54:58 [judofyr gmail.c] Re: [ruby-trunk - Feature #5478] import Set into core, add syntax
41549 11/12/08 23:40:11 [v.ondruch tisca] [ruby-trunk - Feature #5231] Allow to disable versioned paths
41550 11/12/08 23:41:07 [v.ondruch tisca] [ruby-trunk - Feature #5231] Allow to disable versioned paths -------------------------
41551 11/12/09 00:50:33 [dutta.anuj goog] Re: [ANN] 2011 Call for grant proposals
41552 11/12/09 00:51:50 [ruby-core marc-] [ruby-trunk - Bug #5694] Proc#arity doesn't take optional arguments into account.
41553 11/12/09 02:29:05 [ruby-core marc-] [ruby-trunk - Bug #5713] Fixnum#** returns Infinity for 0 ** negative Bignum
41554 11/12/09 04:12:43 [sylvain.daubert] [ruby-trunk - Feature #5623] [PATCH] Update documentation for Complex
41555 11/12/09 05:53:50 [rdmoore appistr] [Backport93 - Backport #5723] Ruby fails when standard input is closed
41556 11/12/09 07:42:19 [tenderlove ruby] Error when loading a converter
41557 11/12/09 08:59:26 [matz ruby-lang.] [ruby-trunk - Bug #5730][Open] Optinal block parameters assigns wrong
41558 11/12/09 09:27:35 [tenderlove ruby] Re: [ruby-trunk - Bug #5730][Open] Optinal block parameters assigns wrong
41559 11/12/09 09:36:00 [akr fsij.org ] Re: [ruby-trunk - Bug #5730][Open] Optinal block parameters assigns wrong
41560 11/12/09 13:39:05 [matz ruby-lang.] Re: [ruby-trunk - Bug #5730][Open] Optinal block parameters assigns wrong
41561 11/12/09 17:31:31 [matthias waecht] Re: [ruby-trunk - Bug #5730][Open] Optinal block parameters assigns wrong
41562 11/12/09 17:41:10 [Konstantin.Haas] Re: [ruby-trunk - Bug #5730][Open] Optinal block parameters assigns wrong
41563 11/12/09 17:44:47 [matz ruby-lang.] Re: [ruby-trunk - Bug #5730][Open] Optinal block parameters assigns wrong
41564 11/12/09 17:45:50 [matz ruby-lang.] Re: [ruby-trunk - Bug #5730][Open] Optinal block parameters assigns wrong
41565 11/12/09 17:49:33 [akr fsij.org ] Re: [ruby-trunk - Bug #5730][Open] Optinal block parameters assigns wrong
41566 11/12/09 17:49:41 [Konstantin.Haas] Re: [ruby-trunk - Bug #5730][Open] Optinal block parameters assigns wrong
41567 11/12/09 17:56:24 [matthias waecht] Re: [ruby-trunk - Bug #5730][Open] Optinal block parameters assigns wrong
41568 11/12/09 18:03:15 [akr fsij.org ] Re: [ruby-trunk - Bug #5730][Open] Optinal block parameters assigns wrong
41569 11/12/09 19:05:41 [muranov math.un] [ruby-trunk - Feature #5478] import Set into core, add syntax
41570 11/12/10 01:19:37 [matz ruby-lang.] Re: [ruby-trunk - Bug #5730][Open] Optinal block parameters assigns wrong
41571 11/12/10 01:36:49 [john.firebaugh ] [ruby-trunk - Bug #5713] Fixnum#** returns Infinity for 0 ** negative Bignum
41572 11/12/10 02:00:58 [john.firebaugh ] [ruby-trunk - Bug #5715] +/-1 ** Bignum returns different results than +/-1 ** Fixnum
41573 11/12/10 03:10:46 [ruby-core marc-] [ruby-trunk - Bug #5713] Fixnum#** returns Infinity for 0 ** negative Bignum
41574 11/12/10 03:44:45 [ruby-core marc-] [ruby-trunk - Bug #5715] +/-1 ** Bignum returns different results than +/-1 ** Fixnum
41575 11/12/10 06:06:51 [john.firebaugh ] [ruby-trunk - Bug #5736][Open] Numeric#quo should convert with #to_r -------------------------
41576 11/12/10 06:17:17 [john.firebaugh ] [ruby-trunk - Bug #5736] Numeric#quo should convert with #to_r
41577 11/12/10 06:23:44 [ruby-ml kittens] Re: [ruby-trunk - Feature #5478] import Set into core, add syntax
41578 11/12/10 06:49:55 [luislavena gmai] [ruby-trunk - Bug #5714] Unexpected error of STDIN#read with non-ascii input on Windows XP
41579 11/12/10 07:05:11 [luislavena gmai] rb_require, search_required and design questions
41580 11/12/10 08:42:23 [john.firebaugh ] [ruby-trunk - Bug #5713] Fixnum#** returns Infinity for 0 ** negative Bignum
41581 11/12/10 09:46:22 [aaron tenderlov] [ruby-trunk - Bug #5737][Open] WEBrick doesn't support keep alive connections for 204 and 304 responses
41582 11/12/10 14:04:34 [nobu ruby-lang.] Re: [ruby-trunk - Bug #5730][Open] Optinal block parameters assigns wrong
41583 11/12/10 15:10:08 [h.shirosaki gma] [ruby-trunk - Bug #5714] Unexpected error of STDIN#read with non-ascii input on Windows XP
41584 11/12/10 23:35:05 [admins fused.ne] [ruby-trunk - Bug #5739] [BUG] object allocation during garbage collection phase
41585 11/12/11 03:46:47 [meta pobox.com ] [ruby-trunk - Bug #5740][Open] Trivial typo in ext/syslog.c
41586 11/12/11 06:02:15 [Martin.Bosslet ] [ruby-trunk - Feature #5741][Open] Secure Erasure of Passwords
41587 11/12/11 07:06:00 [normalperson yh] Re: [ruby-trunk - Feature #5741][Open] Secure Erasure of Passwords
41588 11/12/11 07:20:42 [normalperson yh] Re: [ruby-trunk - Feature #5741][Open] Secure Erasure of Passwords
41589 11/12/11 23:57:05 [naruse airemix.] [ruby-trunk - Bug #5694] Proc#arity doesn't take optional arguments into account.
41590 11/12/12 00:57:32 [matz ruby-lang.] [ruby-trunk - Bug #5694][Rejected] Proc#arity doesn't take optional arguments into account.
41591 11/12/12 01:05:38 [Martin.Bosslet ] [ruby-trunk - Feature #5741] Secure Erasure of Passwords
41592 11/12/12 01:54:02 [ruby-core-maili] My bug evaluation criteria
41593 11/12/12 02:06:26 [ruby-core marc-] [ruby-trunk - Bug #5694][Open] Proc#arity doesn't take optional arguments into account.
41594 11/12/12 02:08:08 [ruby-core marc-] [ruby-trunk - Bug #5746][Open] Proc#curry too strict about lambda's arity.
41595 11/12/12 06:03:35 [matz ruby-lang.] Re: [ruby-trunk - Bug #5694][Open] Proc#arity doesn't take optional arguments into account.
41596 11/12/12 06:06:58 [matz ruby-lang.] Re: [ruby-trunk - Bug #5746][Open] Proc#curry too strict about lambda's arity.
41597 11/12/12 09:30:22 [ruby-core marc-] [ruby-trunk - Bug #5747][Open] Proc#curry doesn't always detect too many arguments
41598 11/12/12 09:36:27 [ruby-core-maili] Re: [ruby-trunk - Bug #5746][Open] Proc#curry too strict about lambda's arity.
41599 11/12/12 10:59:18 [naruse airemix.] Re: My bug evaluation criteria
41600 11/12/12 11:30:26 [ruby-core marc-] [ruby-trunk - Bug #5694] Proc#arity doesn't take optional arguments into account. -------------------------