Issue #11611 has been updated by Martin Drst.

Status changed from Closed to Open

Reopened, because I still get an error, as follows:

$ make up; make install-nodoc
Updating '.':
At revision 52218.
make[1]: Entering directory '/cygdrive/c/Data/ruby-public'
uncommon.mk:853: recipe for target '.revision.time' failed
make[1]: *** [.revision.time] Error 127
make[1]: Leaving directory '/cygdrive/c/Data/ruby-public'
uncommon.mk:943: recipe for target 'up' failed
make: [up] Error 2 (ignored)
make[1]: Entering directory '/cygdrive/c/Data/ruby-public'
config.guess already exists
config.sub already exists
Downloading bundled gem files...
power_assert-0.2.4.gem already exists
test-unit-3.1.3.gem already exists
minitest-5.8.1.gem already exists
rake-10.4.2.gem already exists
net-telnet-0.1.1.gem already exists
did_you_mean-1.0.0.beta2.gem already exists
downloading for ext/fiddle/extlibs
libffi-3.2.1.tar.gz already exists
make[1]: Leaving directory '/cygdrive/c/Data/ruby-public'
        CC = gcc
        LD = ld
        LDSHARED = gcc -shared
        CFLAGS = -O3 -fno-fast-math -ggdb3 -Wall -Wextra -Wno-unused-parameter -Wno-parentheses -Wno-long-long -Wno-missing-field-initializers -Wunused-variable -Werror=pointer-arith -Werror=write-strings -Werror=declaration-after-statement -Werror=implicit-function-declaration -Werror=deprecated-declarations -Wno-packed-bitfield-compat
        XCFLAGS = -D_FORTIFY_SOURCE=2 -fstack-protector -fno-strict-overflow -fvisibility=hidden -DRUBY_EXPORT
        CPPFLAGS =   -I. -I.ext/include/x86_64-cygwin -I./include -I.
        DLDFLAGS = -Wl,--enable-auto-image-base,--enable-auto-import -Wl,--out-implib=libruby230.dll.a cygruby230.def -fstack-protector -Wl,--stack,0x00200000,--enable-auto-import
        SOLIBS = cygruby230.res.o -lpthread -ldl
Using built-in specs.
COLLECT_GCC=gcc
COLLECT_LTO_WRAPPER=/usr/lib/gcc/x86_64-pc-cygwin/4.9.3/lto-wrapper.exe
Target: x86_64-pc-cygwin
Configured with: /cygdrive/i/szsz/tmpp/gcc/gcc-4.9.3-1.x86_64/src/gcc-4.9.3/configure --srcdir=/cygdrive/i/szsz/tmpp/gcc/gcc-4.9.3-1.x86_64/src/gcc-4.9.3 --prefix=/usr --exec-prefix=/usr --localstatedir=/var --sysconfdir=/etc --docdir=/usr/share/doc/gcc --htmldir=/usr/share/doc/gcc/html -C --build=x86_64-pc-cygwin --host=x86_64-pc-cygwin --target=x86_64-pc-cygwin --without-libiconv-prefix --without-libintl-prefix --libexecdir=/usr/lib --enable-shared --enable-shared-libgcc --enable-static --enable-version-specific-runtime-libs --enable-bootstrap --enable-__cxa_atexit --with-dwarf2 --with-tune=generic --enable-languages=ada,c,c++,fortran,lto,objc,obj-c++ --enable-graphite --enable-threads=posix --enable-libatomic--enable-libgomp --disable-libitm --enable-libquadmath --enable-libquadmath-support --enable-libssp --enable-libada --enable-libgcj-sublibs --disable-java-awt --disable-symvers --with-ecj-jar=/usr/share/java/ecj.jar --with-gnu-ld --with-gnu-as --with-cloog-include=/usr/include/cloog-isl --without-libiconv-prefix --without-libintl-prefix --with-system-zlib --enable-linker-build-id
Thread model: posix
gcc version 4.9.3 (GCC)
generating enc.mk
generating prelude.c
prelude.c unchanged
generating encdb.h
encdb.h unchanged
making enc
make[1]: Entering directory '/cygdrive/c/Data/ruby-public'
make[1]: Nothing to be done for 'enc'.
make[1]: Leaving directory '/cygdrive/c/Data/ruby-public'
making srcs under enc
make[1]: Entering directory '/cygdrive/c/Data/ruby-public'
make[1]: Nothing to be done for 'srcs'.
make[1]: Leaving directory '/cygdrive/c/Data/ruby-public'
generating transdb.h
transdb.h unchanged
making trans
make[1]: Entering directory '/cygdrive/c/Data/ruby-public'
make[1]: Nothing to be done for './enc/trans'.
make[1]: Leaving directory '/cygdrive/c/Data/ruby-public'
making encs
make[1]: Entering directory '/cygdrive/c/Data/ruby-public'
make[1]: Leaving directory '/cygdrive/c/Data/ruby-public'
uncommon.mk:853: recipe for target '.revision.time' failed
make: *** [.revision.time] Error 127


----------------------------------------
Bug #11611: uncommon.mk:853: recipe for target '.revision.time' failed
https://bugs.ruby-lang.org/issues/11611#change-54522

* Author: Martin Drst
* Status: Open
* Priority: Normal
* Assignee: Nobuyoshi Nakada
* ruby -v: ruby 2.3.0dev (2015-10-20 trunk 52201) [x86_64-cygwin]
* Backport: 2.0.0: UNKNOWN, 2.1: UNKNOWN, 2.2: UNKNOWN
----------------------------------------
When trying to compile Ruby trunk with
make up; make install-nodoc
I get the following errors:

$ make up; make install-nodoc
Updating '.':
At revision 52214.
make[1]: Entering directory '/cygdrive/c/Data/ruby-public'
uncommon.mk:853: recipe for target '.revision.time' failed
make[1]: *** [.revision.time] Error 127
make[1]: Leaving directory '/cygdrive/c/Data/ruby-public'
uncommon.mk:943: recipe for target 'up' failed
make: [up] Error 2 (ignored)
make[1]: Entering directory '/cygdrive/c/Data/ruby-public'
config.guess already exists
config.sub already exists
generating id.h
./tool/generic_erb.rb:27:in `popen': No such file or directory - tput (Errno::ENOENT)
        from ./tool/generic_erb.rb:27:in `<main>'
uncommon.mk:793: recipe for target 'id.h' failed
make[1]: *** [id.h] Error 1
make[1]: Leaving directory '/cygdrive/c/Data/ruby-public'
uncommon.mk:946: recipe for target 'up' failed
make: [up] Error 2 (ignored)
generating x86_64-cygwin-fake.rb
./tool/generic_erb.rb:27:in `popen': No such file or directory - tput (Errno::ENOENT)
        from ./tool/generic_erb.rb:27:in `<main>'
uncommon.mk:560: recipe for target 'x86_64-cygwin-fake.rb' failed
make: *** [x86_64-cygwin-fake.rb] Error 1




-- 
https://bugs.ruby-lang.org/