Issue #5489 has been updated by Motohiro KOSAKI.

Status changed from Closed to Assigned

I've commited the patch into ruby_1_9_3 as r34185.

----------------------------------------
Backport #5489: Build failure on HP-UX 11.00/PA, 11.11/PA, 11.23/PA
https://bugs.ruby-lang.org/issues/5489

Author: The Written Word Inc
Status: Assigned
Priority: Normal
Assignee: Yuki Sonoda
Category: 
Target version: 


On HP-UX/PA:
  $ bzip2 -dc ruby-1.9.2-p290.tar.bz2 | tar xf -
  $ cd ruby-1.9.2-p290
  $ ./configure
  ...
  $ gmake
  ...
  cc  -g  -I. -I.ext/include/hppa2.0w-hpux11.23 -I./include -I. -DRUBY_EXPORT   -o transcode.o -c transcode.c
  cc: "transcode.c", line 1547: error 1588: "SIZE_MAX" undefined.
  cc: "transcode.c", line 1547: error 1563: Expression in if must be scalar.
  gmake: *** [transcode.o] Error 1



-- 
http://redmine.ruby-lang.org